logo
한국어 Select Language
FF 포럼
포럼지기에게 한 마디
공지사항
뉴스 EZ보드 통합 메뉴얼
FA-VUS 개발환경 !강추! 타켓보드 부팅-HyperTerminal 타켓보드 부팅-Tutty 타켓보드 부팅-minicom Windows환경-타겟 Linux 구동 Linux환경-타겟 Linux 구동 개발 시스템 구축 유형 페도라 설치 CentOS 설치 크로스 컴파일러 설치 TFTP 환경 구축 NFS 파일 시스템 구축 삼바 서버 구축 부트로더 부트로더 쓰기 커널 이미지 제작 및 설치 램디스크 이미지 제작 및 설치
임베디드 제품 사용기 오늘의 영어 휴게실 Appliance
강좌 & 팁
강좌 & 팁 EZ-보드 그래픽 & 멀티미디어 네트워크 프로그래밍 디바이스 드라이버 ImJa 솔루션 임베디드 FLEX 안드로이드 iOS 개발 FAIDE 하드웨어 C/C++ go언어 GNU C 레퍼런스 메뉴얼 ARM 루아 응용 프로젝트 이클립스 지그비 개발자 노트 권장도서 FPGA
VIVADO DSP HSIO Logic Zynq
함수설명
C 라이브러리 함수 커널 API 그래픽 라이브러리 - gxLib
자료실
자료실 FALINUX SDK ARM PC-V210 S3C6410
G100-S3C6410 S100-S3C6410 C221-S3C6410 N200-S3C6410 EZ-S3C6410
S5PV210
G100-S5PV210 S100-S5PV210 N200-S5PV210 C221-S5PV210
EZ-S3C2440 EZ-PXA270 EZ-X5 EZ-S2410 Auto Package
도와주세요
FAQ 도와주세요

  • 회원가입
  • ID/PW 찾기
 
  1. FAQ

  2. 도와주세요


최근 글

  • [특판][성Y인Y용Y품][...
  • 요즘 잘 나가는,,,
  • 요즘은 vmware 말고 ...
  • [docker] buildx 를 ...
  • buildroot 사용 관련
  • GPIO 제어 방법 문의 [1]
  • 임베디드 리눅스 개발...
  • make wandboard_quad ...
  • LCD 초기화 코드 좀 ... [1]
  • 임베디드 리눅스 커널...

최근 댓글

  • 오래 전에 해결법을 터득해서 ...
  • 비트 코인으로 작업하는 것은 ...
  • 10년차 임베 엔지니어 입니다. ...
  • 임베디드쪽이라면 SOC 쪽 displ...
  • 그렇군요 제가 질문이 잘못됬었...
  • 취준생으로서 포트폴리오를 만...
  • 제가 현재 취업준비생입니다. ...
  • 에프에이리눅스 보드는 아래 링...
  • 전체
  • 일반
  • X5
  • S2410
  • ESP-NS
  • S3C2440
  • EP9312
  • 구매
  • 기타

S2410 Qt설치 오류... 이게 어떤 오류일까요?

2008.09.22 20:24

까칠이 조회 수:21215

Qt프로그램 설치하다가 오류가 발생했습니다.
이건 어떤 오류인지요...???
이것만 봐서는 애매한가요?
gcc문제인지 알고 yum install gcc*해서 모두다 설치 했는데 이게 아닌가 보네요.
역시 한번에 되는건 없네요..

Do you accept the terms of either license? yes

Creating qmake. Please wait...
g++ -c -o project.o -pipe -DQMAKE_OPENSOURCE_EDITION -I. -Igenerators -Igenerators/unix -Igenerators/win32 -Igenerators/mac -I/temp/qt-x11-opensource-src-4.3.4/src/corelib/arch/generic -I/temp/qt-x11-opensource-src-4.3.4/include -I/temp/qt-x11-opensource-src-4.3.4/include/QtCore -I/temp/qt-x11-opensource-src-4.3.4/include -I/temp/qt-x11-opensource-src-4.3.4/include/QtCore -I/temp/qt-x11-opensource-src-4.3.4/src/corelib/global -I/temp/qt-x11-opensource-src-4.3.4/src/script -DQT_NO_PCRE -DQT_NO_TEXTCODEC -DQT_NO_UNICODETABLES -DQT_NO_COMPONENT -DQT_NO_STL -DQT_BUILD_QMAKE -DQT_NO_COMPRESS -I/temp/qt-x11-opensource-src-4.3.4/mkspecs/linux-g++ -DHAVE_QCONFIG_CPP -DQT_NO_THREAD -DQT_NO_QOBJECT -DQT_NO_GEOM_VARIANT  project.cpp
In file included from /temp/qt-x11-opensource-src-4.3.4/include/QtCore/qbytearray.h:1,
                 from /temp/qt-x11-opensource-src-4.3.4/include/QtCore/../../src/corelib/tools/qstring.h:48,
                 from /temp/qt-x11-opensource-src-4.3.4/include/QtCore/qstring.h:1,
                 from /temp/qt-x11-opensource-src-4.3.4/include/QtCore/../../src/corelib/io/qiodevice.h:52,
                 from /temp/qt-x11-opensource-src-4.3.4/include/QtCore/qiodevice.h:1,
                 from /temp/qt-x11-opensource-src-4.3.4/include/QtCore/../../src/corelib/io/qdatastream.h:47,
                 from /temp/qt-x11-opensource-src-4.3.4/include/QtCore/qdatastream.h:1,
                 from /temp/qt-x11-opensource-src-4.3.4/include/QtCore/../../src/corelib/tools/qstringlist.h:48,
                 from /temp/qt-x11-opensource-src-4.3.4/include/QtCore/qstringlist.h:1,
                 from project.h:47,
                 from project.cpp:44:
/temp/qt-x11-opensource-src-4.3.4/include/QtCore/../../src/corelib/tools/qbytearray.h:50:20: error: string.h: 그런 파일이나 디렉토리가 없음
In file included from /temp/qt-x11-opensource-src-4.3.4/include/QtCore/qtextstream.h:1,
                 from project.h:48,
                 from project.cpp:44:
/temp/qt-x11-opensource-src-4.3.4/include/QtCore/../../src/corelib/io/qtextstream.h:57:19: error: stdio.h: 그런 파일이나 디렉토리가 없음
In file included from /temp/qt-x11-opensource-src-4.3.4/include/QtCore/qvector.h:1,
                 from /temp/qt-x11-opensource-src-4.3.4/include/QtCore/../../src/corelib/tools/qstack.h:47,
                 from /temp/qt-x11-opensource-src-4.3.4/include/QtCore/qstack.h:1,
                 from project.h:50,
                 from project.cpp:44:

이 게시물을
  • Twitter
  • Facebook
  • Delicious
수정 삭제 목록

댓글 10

  • 까칠이

    2008.09.22 21:05

    ./configure -prefix /qt4/qt-mips -embedded mips -little-endian -release -no-largefile -no-accessibility -no-qt3support -qt-zlib -qt-gif -qt-libpng -no-libmng -qt-libjpeg -qt-mouse-tslib -I/qt4/tslib-mips/include -L/qt4/tslib-mips/lib -no-nis -no-cups -qt-freetype -depths 16,24,32

    이걸 S2410에 그대로 명령을 줬는데 고쳐주지 않아서 오류가 뜨는건가요? 만약 그렇다면 어떻게 바꿔야 하나요?

    댓글 수정 삭제

  • 장길석

    2008.09.22 23:10

    에러 내용에 stdio.h 와 string.h 같은 기본 헤더파일의 위치를 찾지 못하는 것으로 보아
    gcc 설치가 제대로 안 된 것으로 생각됩니다.

    우선 간단히 샘플 C 프로그램을 작성하신 후, 컴파일이 되는지 확인해 보세요.
    복잡하지 않아도 됩니다.

    #include <stdio.h>

    int main( void)
    {
       printf( "Hello C.\n");   // 꼭 끝에 \n을 넣으세요.
       return 0;
    }

    컴파일이 정상적으로 되나요?

    댓글

  • 까칠이

    2008.09.23 00:20

    컴파일이 안되는거 같은데요.
    텍스트편집기에서 소스를 test.c라고 저장하고 gcc test.c라는 명령을 줬는데 이렇게 하는게 맞나요?
    ㅡㅡ; 아직 리눅스에 대한 사용방법이 익숙치가 않아서.. 죄송합니다....

    [root@lmj ~]# gcc test.c
    test.c:1:19: error: stdio.h: 그런 파일이나 디렉토리가 없음
    test.c: In function ‘main’:
    test.c:5: warning: incompatible implicit declaration of built-in function ‘printf’


    댓글 수정 삭제

  • 까칠이

    2008.09.23 00:26

    gcc가 있는지 확인을 해봤는데 이렇게 목록이 나옵니다.
    부족한 부분이 있나요?

    [root@lmj ~]# rpm -qa|grep gcc
    gcc-c++-4.1.2-27.fc7
    gcc-java-4.1.2-27.fc7
    gcc-4.1.2-27.fc7
    libgcc-4.1.2-27.fc7
    gcc-objc-4.1.2-27.fc7
    gcc-gfortran-4.1.2-27.fc7
    gcc-gnat-4.1.2-27.fc7
    gcc-objc++-4.1.2-27.fc7

    댓글 수정 삭제

  • 장길석

    2008.09.23 02:45

    죄송하다니요, 절대 아닙니다. 모두 초보 시절이 있었는데요. ^^

    우선 gcc 를 아래와 같이 확인해서 정보가 뜨지 않는다면
    gcc 컴파일러의 위치와 헤더파일, 라이브러리 위치를 수동으로라도 세팅해 주셔야 합니다.

    ]$ gcc --version
    gcc (GCC) 4.1.2 20071124 (Red Hat 4.1.2-42)
    Copyright (C) 2006 Free Software Foundation, Inc.
    This is free software; see the source for copying conditions.  There is NO
    warranty; not even for MERCHANTABILITY or FITNESS FOR A PARTICULAR PURPOSE.

    ]$

    저는 rmp으로 설치하지 않고, 리눅스를 설치할 때 선택하여 설치했기 때문에
    설정하는 방법은 저도 모릅니다만 웹 검색으로 찾아 보시면 내용이 있지 않을까 싶습니다.

    또한 리눅스를 학습하시면서 새로 설치하셨다면 리눅스 설치도 학습의 한 단계라 생각하시고,
    처음부터 다시 설치하시는 것도 권하고 싶습니다. ^^

    댓글

  • 까칠이

    2008.09.23 02:50

    gcc컴파일이 안되는 줄 알았더니 경로를 아래와 같이 설정해주면 컴파일이 됩니다.
    그럼 이 문제는 아니고 또 뭐가 있을까요? 안되는 이유가 그것도 경로문제일까요?
    어떻게 해야할지... 명령어도 진짜 복잡하고 응용을 할 수가 없으니...
    please, help me out~~~^^

    혹시 ,
    ./configure -prefix /qt4/qt-mips -embedded mips -little-endian -release -no-largefile -no-accessibility -no-qt3support -qt-zlib -qt-gif -qt-libpng -no-libmng -qt-libjpeg -qt-mouse-tslib -I/qt4/tslib-mips/include -L/qt4/tslib-mips/lib -no-nis -no-cups -qt-freetype -depths 16,24,32

    명령에서 -mips라는 문구를 딴 것으로 바꿔주거나 그렇게 해야 될꺼 같은데... 맞나요?
    바꾼다면 어떻게 바꿔야 되는지요.. 현재 S2410보드를 사용하고 있습니다.


    [root@lmj test]# gcc -I/root/usr/arm-linux/include test.c
    [root@lmj test]# ls
    a.out  test.c

    댓글 수정 삭제

  • 장길석

    2008.09.23 03:36

    컴파일이 정상적으로 된다니 다행입니다. 우선 s3c2440은 arm 칩이므로 -mips 가 아닌 arm으로 변경하시고 설치하시면 되겠습니다.

    설치 방법은 http://forum.falinux.com/zbxe/?mid=lecture_tip&document_srl=462351&listStyle=&cpage=   글을 참고하세요. ^^

    댓글

  • 까칠이

    2008.09.23 04:27

    안됩니다.. ㅜㅜ 똑같이 에러가... 이대로 정녕 터치를 못해보는거 아닌가 모르겠네요.. ㅜㅜ
    오똑하죠? OTL

    댓글 수정 삭제

  • 까칠이

    2008.09.23 04:29

    오류는 아래와 같습니다. 한번만 더 봐~ 주이소.....^^;

    [root@lmj qtopia-core-opensource-src-4.3.4]# ./configure -prefix /qt4/qt-arm -embedded arm -little-endian -release -no-largefile -no-accessibility -no-qt3support -qt-zlib -qt-gif -qt-libpng -no-libmng -qt-libjpeg -no-nis -no-cups -qt-freetype -depths 16,24,32

    This is the Qtopia Core Open Source Edition.

    You are licensed to use this software under the terms of
    the GNU General Public License (GPL) versions 2 or 3.

    Type '2' to view the GNU General Public License version 2.
    Type '3' to view the GNU General Public License version 3.
    Type 'yes' to accept this license offer.
    Type 'no' to decline this license offer.

    Do you accept the terms of the license? yes

    Creating qmake. Please wait...
    g++ -c -o project.o -pipe -DQMAKE_OPENSOURCE_EDITION -I. -Igenerators -Igenerators/unix -Igenerators/win32 -Igenerators/mac -I/temp/qtopia-core-opensource-src-4.3.4/src/corelib/arch/generic -I/temp/qtopia-core-opensource-src-4.3.4/include -I/temp/qtopia-core-opensource-src-4.3.4/include/QtCore -I/temp/qtopia-core-opensource-src-4.3.4/include -I/temp/qtopia-core-opensource-src-4.3.4/include/QtCore -I/temp/qtopia-core-opensource-src-4.3.4/src/corelib/global -I/temp/qtopia-core-opensource-src-4.3.4/src/script -DQT_NO_PCRE -DQT_NO_TEXTCODEC -DQT_NO_UNICODETABLES -DQT_NO_COMPONENT -DQT_NO_STL -DQT_BUILD_QMAKE -DQT_NO_COMPRESS -I/temp/qtopia-core-opensource-src-4.3.4/mkspecs/qws/linux-x86-g++ -DHAVE_QCONFIG_CPP -DQT_NO_THREAD -DQT_NO_QOBJECT -DQT_NO_GEOM_VARIANT  project.cpp
    In file included from /temp/qtopia-core-opensource-src-4.3.4/include/QtCore/qbytearray.h:1,
                     from /temp/qtopia-core-opensource-src-4.3.4/include/QtCore/../../src/corelib/tools/qstring.h:48,
                     from /temp/qtopia-core-opensource-src-4.3.4/include/QtCore/qstring.h:1,
                     from /temp/qtopia-core-opensource-src-4.3.4/include/QtCore/../../src/corelib/io/qiodevice.h:52,
                     from /temp/qtopia-core-opensource-src-4.3.4/include/QtCore/qiodevice.h:1,
                     from /temp/qtopia-core-opensource-src-4.3.4/include/QtCore/../../src/corelib/io/qdatastream.h:47,
                     from /temp/qtopia-core-opensource-src-4.3.4/include/QtCore/qdatastream.h:1,
                     from /temp/qtopia-core-opensource-src-4.3.4/include/QtCore/../../src/corelib/tools/qstringlist.h:48,
                     from /temp/qtopia-core-opensource-src-4.3.4/include/QtCore/qstringlist.h:1,
                     from project.h:47,
                     from project.cpp:44:
    /temp/qtopia-core-opensource-src-4.3.4/include/QtCore/../../src/corelib/tools/qbytearray.h:50:20: error: string.h: 그런 파일이나 디렉토리가 없음
    In file included from /temp/qtopia-core-opensource-src-4.3.4/include/QtCore/qtextstream.h:1,
                     from project.h:48,
                     from project.cpp:44:
    /temp/qtopia-core-opensource-src-4.3.4/include/QtCore/../../src/corelib/io/qtextstream.h:57:19: error: stdio.h: 그런 파일이나 디렉토리가 없음
    In file included from /temp/qtopia-core-opensource-src-4.3.4/include/QtCore/qvector.h:1,
                     from /temp/qtopia-core-opensource-src-4.3.4/include/QtCore/../../src/corelib/tools/qstack.h:47,
                     from /temp/qtopia-core-opensource-src-4.3.4/include/QtCore/qstack.h:1,
                     from project.h:50,
                     from project.cpp:44:
    /temp/qtopia-core-opensource-src-4.3.4/include/QtCore/../../src/corelib/tools/qvector.h:56:20: error: stdlib.h: 그런 파일이나 디렉토리가 없음
    project.cpp:59:20: error: unistd.h: 그런 파일이나 디렉토리가 없음
    project.cpp:60:25: error: sys/utsname.h: 그런 파일이나 디렉토리가 없음
    /temp/qtopia-core-opensource-src-4.3.4/include/QtCore/../../src/corelib/tools/qbytearray.h: In function ‘uint qstrlen(const char*)’:
    /temp/qtopia-core-opensource-src-4.3.4/include/QtCore/../../src/corelib/tools/qbytearray.h:68: error: ‘strlen’ was not declared in this scope
    /temp/qtopia-core-opensource-src-4.3.4/include/QtCore/../../src/corelib/tools/qbytearray.h: In function ‘int qstrncmp(const char*, const char*, uint)’:
    /temp/qtopia-core-opensource-src-4.3.4/include/QtCore/../../src/corelib/tools/qbytearray.h:87: error: ‘strncmp’ was not declared in this scope
    /temp/qtopia-core-opensource-src-4.3.4/include/QtCore/../../src/corelib/tools/qbytearray.h: In function ‘bool operator==(const QByteArray&, const QByteArray&)’:
    /temp/qtopia-core-opensource-src-4.3.4/include/QtCore/../../src/corelib/tools/qbytearray.h:459: error: ‘memcmp’ was not declared in this scope
    /temp/qtopia-core-opensource-src-4.3.4/include/QtCore/../../src/corelib/tools/qbytearray.h: In function ‘bool operator==(const QByteArray&, const char*)’:
    /temp/qtopia-core-opensource-src-4.3.4/include/QtCore/../../src/corelib/tools/qbytearray.h:461: error: ‘strcmp’ was not declared in this scope
    /temp/qtopia-core-opensource-src-4.3.4/include/QtCore/../../src/corelib/tools/qbytearray.h: In function ‘bool operator==(const char*, const QByteArray&)’:
    /temp/qtopia-core-opensource-src-4.3.4/include/QtCore/../../src/corelib/tools/qbytearray.h:463: error: ‘strcmp’ was not declared in this scope
    /temp/qtopia-core-opensource-src-4.3.4/include/QtCore/../../src/corelib/tools/qbytearray.h: In function ‘bool operator!=(const QByteArray&, const char*)’:
    /temp/qtopia-core-opensource-src-4.3.4/include/QtCore/../../src/corelib/tools/qbytearray.h:467: error: ‘strcmp’ was not declared in this scope
    /temp/qtopia-core-opensource-src-4.3.4/include/QtCore/../../src/corelib/tools/qbytearray.h: In function ‘bool operator!=(const char*, const QByteArray&)’:
    /temp/qtopia-core-opensource-src-4.3.4/include/QtCore/../../src/corelib/tools/qbytearray.h:469: error: ‘strcmp’ was not declared in this scope
    /temp/qtopia-core-opensource-src-4.3.4/include/QtCore/../../src/corelib/tools/qbytearray.h: In function ‘bool operator<(const QByteArray&, const QByteArray&)’:
    /temp/qtopia-core-opensource-src-4.3.4/include/QtCore/../../src/corelib/tools/qbytearray.h:471: error: ‘strcmp’ was not declared in this scope
    /temp/qtopia-core-opensource-src-4.3.4/include/QtCore/../../src/corelib/tools/qbytearray.h: In function ‘bool operator<=(const QByteArray&, const QByteArray&)’:
    /temp/qtopia-core-opensource-src-4.3.4/include/QtCore/../../src/corelib/tools/qbytearray.h:477: error: ‘strcmp’ was not declared in this scope
    /temp/qtopia-core-opensource-src-4.3.4/include/QtCore/../../src/corelib/tools/qbytearray.h: In function ‘bool operator>(const QByteArray&, const QByteArray&)’:
    /temp/qtopia-core-opensource-src-4.3.4/include/QtCore/../../src/corelib/tools/qbytearray.h:483: error: ‘strcmp’ was not declared in this scope
    /temp/qtopia-core-opensource-src-4.3.4/include/QtCore/../../src/corelib/tools/qbytearray.h: In function ‘bool operator>=(const QByteArray&, const QByteArray&)’:
    /temp/qtopia-core-opensource-src-4.3.4/include/QtCore/../../src/corelib/tools/qbytearray.h:489: error: ‘strcmp’ was not declared in this scope
    /temp/qtopia-core-opensource-src-4.3.4/include/QtCore/../../src/corelib/io/qtextstream.h: At global scope:
    /temp/qtopia-core-opensource-src-4.3.4/include/QtCore/../../src/corelib/io/qtextstream.h:103: error: expected `)' before ‘*’ token
    /temp/qtopia-core-opensource-src-4.3.4/include/QtCore/../../src/corelib/io/qfile.h:146: error: ‘FILE’ has not been declared
    cachekeys.h: In function ‘void qmakeFreeCacheClear(void*)’:
    cachekeys.h:175: error: ‘free’ was not declared in this scope
    project.cpp: In function ‘void qmake_error_msg(const QString&)’:
    project.cpp:584: error: ‘stderr’ was not declared in this scope
    project.cpp:585: error: ‘fprintf’ was not declared in this scope
    project.cpp: In member function ‘void QMakeProjectEnv::execute(const QMap<QString, QStringList>&)’:
    project.cpp:712: error: ‘strdup’ was not declared in this scope
    project.cpp:712: error: ‘putenv’ was not declared in this scope
    project.cpp: In destructor ‘QMakeProjectEnv::~QMakeProjectEnv()’:
    project.cpp:723: error: ‘strdup’ was not declared in this scope
    project.cpp:723: error: ‘putenv’ was not declared in this scope
    project.cpp: In member function ‘bool QMakeProject::parse(const QString&, QMap<QString, QStringList>&, int)’:
    project.cpp:802: error: ‘stderr’ was not declared in this scope
    project.cpp:802: error: ‘fprintf’ was not declared in this scope
    project.cpp:965: error: ‘stderr’ was not declared in this scope
    project.cpp:966: error: ‘fprintf’ was not declared in this scope
    project.cpp:970: error: ‘stderr’ was not declared in this scope
    project.cpp:971: error: ‘fprintf’ was not declared in this scope
    project.cpp:974: error: ‘stderr’ was not declared in this scope
    project.cpp:975: error: ‘fprintf’ was not declared in this scope
    project.cpp:987: error: ‘stderr’ was not declared in this scope
    project.cpp:988: error: ‘fprintf’ was not declared in this scope
    project.cpp:1028: error: ‘stderr’ was not declared in this scope
    project.cpp:1030: error: ‘fprintf’ was not declared in this scope
    project.cpp:1034: error: ‘stderr’ was not declared in this scope
    project.cpp:1035: error: ‘fprintf’ was not declared in this scope
    project.cpp:1104: error: ‘stderr’ was not declared in this scope
    project.cpp:1104: error: ‘fprintf’ was not declared in this scope
    project.cpp:1177: error: ‘stdout’ was not declared in this scope
    project.cpp:1177: error: ‘fprintf’ was not declared in this scope
    project.cpp:1180: error: ‘stdout’ was not declared in this scope
    project.cpp:1180: error: ‘fprintf’ was not declared in this scope
    project.cpp: In member function ‘bool QMakeProject::read(const QString&, QMap<QString, QStringList>&)’:
    project.cpp:1331: error: ‘strcmp’ was not declared in this scope
    project.cpp:1333: error: ‘stdin’ was not declared in this scope
    project.cpp: In member function ‘bool QMakeProject::read(uchar)’:
    project.cpp:1434: error: ‘stderr’ was not declared in this scope
    project.cpp:1434: error: ‘fprintf’ was not declared in this scope
    project.cpp:1456: error: ‘stderr’ was not declared in this scope
    project.cpp:1457: error: ‘fprintf’ was not declared in this scope
    project.cpp:1472: error: ‘stderr’ was not declared in this scope
    project.cpp:1472: error: ‘fprintf’ was not declared in this scope
    project.cpp:1504: error: ‘stderr’ was not declared in this scope
    project.cpp:1504: error: ‘fprintf’ was not declared in this scope
    project.cpp:1545: error: ‘stderr’ was not declared in this scope
    project.cpp:1545: error: ‘fprintf’ was not declared in this scope
    project.cpp: In member function ‘bool QMakeProject::isActiveConfig(const QString&, bool, QMap<QString, QStringList>*)’:
    project.cpp:1634: error: ‘malloc’ was not declared in this scope
    project.cpp:1637: error: ‘readlink’ was not declared in this scope
    project.cpp: In member function ‘QMakeProject::IncludeStatus QMakeProject::doProjectInclude(QString, uchar, QMap<QString, QStringList>&)’:
    project.cpp:1784: error: ‘stderr’ was not declared in this scope
    project.cpp:1786: error: ‘fprintf’ was not declared in this scope
    project.cpp:1795: error: ‘stderr’ was not declared in this scope
    project.cpp:1795: error: ‘fprintf’ was not declared in this scope
    project.cpp:1811: error: ‘stderr’ was not declared in this scope
    project.cpp:1812: error: ‘fprintf’ was not declared in this scope
    project.cpp: In member function ‘QStringList QMakeProject::doProjectExpand(QString, QList<QStringList>, QMap<QString, QStringList>&)’:
    project.cpp:1910: error: ‘stderr’ was not declared in this scope
    project.cpp:1911: error: ‘fprintf’ was not declared in this scope
    project.cpp:1929: error: ‘stderr’ was not declared in this scope
    project.cpp:1931: error: ‘fprintf’ was not declared in this scope
    project.cpp:1937: error: ‘stderr’ was not declared in this scope
    project.cpp:1939: error: ‘fprintf’ was not declared in this scope
    project.cpp:1962: error: ‘stderr’ was not declared in this scope
    project.cpp:1963: error: ‘fprintf’ was not declared in this scope
    project.cpp:1976: error: ‘stderr’ was not declared in this scope
    project.cpp:1977: error: ‘fprintf’ was not declared in this scope
    project.cpp:2000: error: ‘stderr’ was not declared in this scope
    project.cpp:2001: error: ‘fprintf’ was not declared in this scope
    project.cpp:2022: error: ‘stderr’ was not declared in this scope
    project.cpp:2023: error: ‘fprintf’ was not declared in this scope
    project.cpp:2033: error: ‘stderr’ was not declared in this scope
    project.cpp:2034: error: ‘fprintf’ was not declared in this scope
    project.cpp:2053: error: ‘stderr’ was not declared in this scope
    project.cpp:2054: error: ‘fprintf’ was not declared in this scope
    project.cpp:2064: error: ‘stderr’ was not declared in this scope
    project.cpp:2065: error: ‘fprintf’ was not declared in this scope
    project.cpp:2081: error: ‘stderr’ was not declared in this scope
    project.cpp:2082: error: ‘fprintf’ was not declared in this scope
    project.cpp:2103: error: ‘stderr’ was not declared in this scope
    project.cpp:2104: error: ‘fprintf’ was not declared in this scope
    project.cpp:2114: error: ‘stderr’ was not declared in this scope
    project.cpp:2115: error: ‘fprintf’ was not declared in this scope
    project.cpp:2139: error: ‘stderr’ was not declared in this scope
    project.cpp:2140: error: ‘fprintf’ was not declared in this scope
    project.cpp:2153: error: ‘stderr’ was not declared in this scope
    project.cpp:2154: error: ‘fprintf’ was not declared in this scope
    project.cpp:2158: error: ‘FILE’ was not declared in this scope
    project.cpp:2158: error: ‘proc’ was not declared in this scope
    project.cpp:2158: error: ‘popen’ was not declared in this scope
    project.cpp:2163: error: ‘feof’ was not declared in this scope
    project.cpp:2164: error: ‘fread’ was not declared in this scope
    project.cpp:2179: error: ‘stderr’ was not declared in this scope
    project.cpp:2180: error: ‘fprintf’ was not declared in this scope
    project.cpp:2213: error: ‘memmove’ was not declared in this scope
    project.cpp:2239: error: ‘stderr’ was not declared in this scope
    project.cpp:2240: error: ‘fprintf’ was not declared in this scope
    project.cpp:2278: error: ‘stderr’ was not declared in this scope
    project.cpp:2279: error: ‘fprintf’ was not declared in this scope
    project.cpp:2281: error: ‘stderr’ was not declared in this scope
    project.cpp:2282: error: ‘fprintf’ was not declared in this scope
    project.cpp:2287: error: ‘stderr’ was not declared in this scope
    project.cpp:2288: error: ‘fprintf’ was not declared in this scope
    project.cpp:2291: error: ‘stdin’ was not declared in this scope
    project.cpp:2299: error: ‘stderr’ was not declared in this scope
    project.cpp:2300: error: ‘fprintf’ was not declared in this scope
    project.cpp:2323: error: ‘stderr’ was not declared in this scope
    project.cpp:2325: error: ‘fprintf’ was not declared in this scope
    project.cpp: In member function ‘bool QMakeProject::doProjectTest(QString, QList<QStringList>, QMap<QString, QStringList>&)’:
    project.cpp:2368: error: ‘stderr’ was not declared in this scope
    project.cpp:2371: error: ‘fprintf’ was not declared in this scope
    project.cpp:2392: error: ‘stderr’ was not declared in this scope
    project.cpp:2393: error: ‘fprintf’ was not declared in this scope
    project.cpp:2412: error: ‘stderr’ was not declared in this scope
    project.cpp:2413: error: ‘fprintf’ was not declared in this scope
    project.cpp:2455: error: ‘stderr’ was not declared in this scope
    project.cpp:2456: error: ‘fprintf’ was not declared in this scope
    project.cpp:2462: error: ‘stderr’ was not declared in this scope
    project.cpp:2463: error: ‘fprintf’ was not declared in this scope
    project.cpp:2481: error: ‘stderr’ was not declared in this scope
    project.cpp:2482: error: ‘fprintf’ was not declared in this scope
    project.cpp:2494: error: ‘stderr’ was not declared in this scope
    project.cpp:2495: error: ‘fprintf’ was not declared in this scope
    project.cpp:2504: error: ‘stderr’ was not declared in this scope
    project.cpp:2505: error: ‘fprintf’ was not declared in this scope
    project.cpp:2514: error: ‘stderr’ was not declared in this scope
    project.cpp:2515: error: ‘fprintf’ was not declared in this scope
    project.cpp:2529: error: ‘stderr’ was not declared in this scope
    project.cpp:2530: error: ‘fprintf’ was not declared in this scope
    project.cpp:2547: error: ‘stderr’ was not declared in this scope
    project.cpp:2548: error: ‘fprintf’ was not declared in this scope
    project.cpp:2558: error: ‘system’ was not declared in this scope
    project.cpp:2562: error: ‘stderr’ was not declared in this scope
    project.cpp:2563: error: ‘fprintf’ was not declared in this scope
    project.cpp:2577: error: ‘stderr’ was not declared in this scope
    project.cpp:2578: error: ‘fprintf’ was not declared in this scope
    project.cpp:2584: error: ‘stderr’ was not declared in this scope
    project.cpp:2585: error: ‘fprintf’ was not declared in this scope
    project.cpp:2589: error: ‘stderr’ was not declared in this scope
    project.cpp:2590: error: ‘fprintf’ was not declared in this scope
    project.cpp:2597: error: ‘stderr’ was not declared in this scope
    project.cpp:2599: error: ‘fprintf’ was not declared in this scope
    project.cpp:2608: error: ‘stderr’ was not declared in this scope
    project.cpp:2609: error: ‘fprintf’ was not declared in this scope
    project.cpp:2633: error: ‘stderr’ was not declared in this scope
    project.cpp:2634: error: ‘fprintf’ was not declared in this scope
    project.cpp:2665: error: ‘stderr’ was not declared in this scope
    project.cpp:2666: error: ‘fprintf’ was not declared in this scope
    project.cpp:2681: error: ‘stderr’ was not declared in this scope
    project.cpp:2682: error: ‘fprintf’ was not declared in this scope
    project.cpp:2688: error: ‘stderr’ was not declared in this scope
    project.cpp:2689: error: ‘fprintf’ was not declared in this scope
    project.cpp:2709: error: ‘stderr’ was not declared in this scope
    project.cpp:2710: error: ‘fprintf’ was not declared in this scope
    project.cpp:2748: error: ‘printf’ was not declared in this scope
    project.cpp:2753: error: ‘exit’ was not declared in this scope
    project.cpp:2761: error: ‘stderr’ was not declared in this scope
    project.cpp:2762: error: ‘fprintf’ was not declared in this scope
    project.cpp:2772: error: ‘stderr’ was not declared in this scope
    project.cpp:2773: error: ‘fprintf’ was not declared in this scope
    project.cpp:2777: error: ‘stderr’ was not declared in this scope
    project.cpp:2777: error: ‘fprintf’ was not declared in this scope
    project.cpp:2782: error: ‘exit’ was not declared in this scope
    project.cpp:2800: error: ‘stderr’ was not declared in this scope
    project.cpp:2801: error: ‘fprintf’ was not declared in this scope
    project.cpp: In member function ‘QStringList& QMakeProject::values(const QString&, QMap<QString, QStringList>&)’:
    project.cpp:3164: error: aggregate ‘utsname name’ has incomplete type and cannot be defined
    project.cpp:3165: error: ‘uname’ was not declared in this scope
    gmake: *** [project.o] 오류 1

    댓글 수정 삭제

  • 장길석

    2008.09.23 07:39

    죄송하지만 gcc 환경이 옳바르게 설정되지 않는 것으로 생각됩니다.
    지금 보시면 아시겠습니다만, 에러 내용이 표준 C 함수를 제대로 찾지 못한다는 내용입니다.
    그러므로 gcc 환경을 먼저 잡으십시오.
    또한 죄송한 말씀입니다만 qt 를 하시기 전에 먼저 리눅스 C 언어를 학습하시고
    그래서 C 언어에 익숙해 지신 다음에 qt를 하시기를 권합니다.
    qt 가 아쉽게도 독자적인 컴파일러를 제공하지 않기 때문에
    C 언어에 대한 학습이 먼저 선행되어야 합니다.

    댓글

목록
번호 제목 글쓴이 날짜 조회 수
공지 포럼의 메뉴가 보이지 않아요! 장길석 2014.02.06 957649
공지 [중요 공지]제품 사용 및 기술 문의는 전화 상담을 받지 않습니다. 장길석 2012.11.09 1408539
공지 답글에 대한 공지 사항. falinux 2006.11.20 2424031
378 check_usb_vfs("/dev/bus/usb")에서 에러 생생맥주 2015.01.25 13757
377 OTG USB 2.0 포트 사용법이 궁금합니다. 주다시오시네 2012.09.26 22402
376 그림파일 PNG 를 타이머를 사용하여 출력하는데요. 시간이 지나면 프로그램이 죽어요? [1] 가을짱 2012.03.19 15842
375 ezboot 설정 질문 입니다. (SDRAM 설정) [2] file 다비치 2011.06.15 18030
374 이제 임베디드를 시작하려는 학생입니다. [1] 오사장 2011.01.31 24825
373 SDRAM 확장 관련 file 일탈 2010.09.30 28521
372 jtag를 이용해서 부트로더를 손좀보려는데.... 안되네용...ㅠ 매너쟁이 2010.06.22 34729
371 보드 재부팅시 이상한점 질문이요 ㅠㅠㅠ 매너쟁이 2010.06.06 24915
370 기존 s3c2440이나 pxa270의 커널 업버전 계획은 없나요? [1] katsu12 2010.04.30 36859
369 Ramdisk 용량을 늘려서 사용하려고 합니다. file 트루진 2010.04.28 25319
368 업로드 실패... 군집 로봇 2010.04.01 34132
367 ramdisk 용량관련 질문이욤~_~ 매너쟁이 2010.03.29 19578
366 보드에서 인터넷 ping 테스트가 안됩니다 ㅠ [2] 트루진 2010.03.24 31255
365 밑에 글에 이어서 질문드립니다~ [3] 트루진 2010.03.18 19787
364 보드에 랜선꽂아 바로 인터넷 연결하기 질문이요 ~_~ [1] 매너쟁이 2010.03.18 27103
363 자동로그인 vs 부팅중 프로그램 실행 질문이욤~~ㅠㅠ [2] 매너쟁이 2010.03.17 22390
362 파일시스템을 RAMDISK로 설정하려면 [1] 구름 2010.03.12 25255
361 임베디드 보드에서 USB 마우스를 인식했는데요, QT4 연동을 어떻게 해야 될지 모르겠습니다 보거스 2009.10.24 22578
360 웹캠에 대한질문인데요.. 생각하는곰 2009.09.10 11026
359 캠 설치 관련 selly 2009.09.05 10788
첫 페이지 1 2 3 4 5 6 7 8 9 10 끝 페이지
쓰기
태그
부탁드립니다. ^^
  • 글을 작성하시려면 회원으로 가입하시고 로그인 하셔야 합니다.
  • 회원 가입은 주민등록번호가 필요 없으며, 메일 주소만 있으면 간단하게 가입하실 수 있습니다.
  • 본 포럼에 등록된 모든 글의 저작권은 작성하신 분께 있으며, 저작자의 허락 없이 다른 곳에 펌이나 도용하시면 안 됩니다.
  • 또한, 전자우편 수집 프로그램이나 그 밖의 기술적 장치를 이용하여 무단으로 이메일 주소 및 자료 수집되는 것을 거부하며,
  • 이를 위반 시 정보통신망 법에 의해 형사 처벌됨을 유념하시기 바랍니다.
  • FF 포럼
  • 강좌 & 팁
  • 함수설명
  • 자료실
  • 도와주세요