logo
한국어 Select Language
FF 포럼
포럼지기에게 한 마디
공지사항
뉴스 EZ보드 통합 메뉴얼
FA-VUS 개발환경 !강추! 타켓보드 부팅-HyperTerminal 타켓보드 부팅-Tutty 타켓보드 부팅-minicom Windows환경-타겟 Linux 구동 Linux환경-타겟 Linux 구동 개발 시스템 구축 유형 페도라 설치 CentOS 설치 크로스 컴파일러 설치 TFTP 환경 구축 NFS 파일 시스템 구축 삼바 서버 구축 부트로더 부트로더 쓰기 커널 이미지 제작 및 설치 램디스크 이미지 제작 및 설치
임베디드 제품 사용기 오늘의 영어 휴게실 Appliance
강좌 & 팁
강좌 & 팁 EZ-보드 그래픽 & 멀티미디어 네트워크 프로그래밍 디바이스 드라이버 ImJa 솔루션 임베디드 FLEX 안드로이드 iOS 개발 FAIDE 하드웨어 C/C++ go언어 GNU C 레퍼런스 메뉴얼 ARM 루아 응용 프로젝트 이클립스 지그비 개발자 노트 권장도서 FPGA
VIVADO DSP HSIO Logic Zynq
함수설명
C 라이브러리 함수 커널 API 그래픽 라이브러리 - gxLib
자료실
자료실 FALINUX SDK ARM PC-V210 S3C6410
G100-S3C6410 S100-S3C6410 C221-S3C6410 N200-S3C6410 EZ-S3C6410
S5PV210
G100-S5PV210 S100-S5PV210 N200-S5PV210 C221-S5PV210
EZ-S3C2440 EZ-PXA270 EZ-X5 EZ-S2410 Auto Package
도와주세요
FAQ 도와주세요

  • 회원가입
  • ID/PW 찾기
 
  1. FAQ

  2. 도와주세요


최근 글

  • [특판][성Y인Y용Y품][...
  • 요즘 잘 나가는,,,
  • 요즘은 vmware 말고 ...
  • [docker] buildx 를 ...
  • buildroot 사용 관련
  • GPIO 제어 방법 문의 [1]
  • 임베디드 리눅스 개발...
  • make wandboard_quad ...
  • LCD 초기화 코드 좀 ... [1]
  • 임베디드 리눅스 커널...

최근 댓글

  • 오래 전에 해결법을 터득해서 ...
  • 비트 코인으로 작업하는 것은 ...
  • 10년차 임베 엔지니어 입니다. ...
  • 임베디드쪽이라면 SOC 쪽 displ...
  • 그렇군요 제가 질문이 잘못됬었...
  • 취준생으로서 포트폴리오를 만...
  • 제가 현재 취업준비생입니다. ...
  • 에프에이리눅스 보드는 아래 링...
  • 전체
  • 일반
  • X5
  • S2410
  • ESP-NS
  • S3C2440
  • EP9312
  • 구매
  • 기타

G100-S3C6410 rt73 드라이버 컴파일 관련

2012.04.16 23:51

windchaser 조회 수:14991

안녕하세요,


여전히 G100-S3C6410용으로 rt73 드라이버를 컴파일하는데 문제가 발생하고 있습니다.


rt73 드라이버를 다운로드 받아서 Makefile를 수정하여 커널 위치를 다음과 같이 바꿔주고,


LINUX_SRC = /home/administrator/Desktop/share/G100-S3C6410/kernel/linux-2.6.29-co


make 명령으로 컴파일을 하면 다음과 같은 에러가 발생합니다.


...

  from /home/administrator/Desktop/share/G100-S3C6410/wireless/rt73_linux_sta_drv1.1.0.3/Module/rtmp_main.c:40:

/home/administrator/Desktop/share/G100-S3C6410/kernel/linux-2.6.29-co/arch/arm/include/asm/bitops.h:237:5: warning: "__LINUX_ARM_ARCH__" is not defined

In file included from /home/administrator/Desktop/share/G100-S3C6410/kernel/linux-2.6.29-co/arch/arm/include/asm/thread_info.h:16,

                 from include/linux/thread_info.h:55,

                 from include/linux/preempt.h:9,

                 from include/linux/spinlock.h:50,

                 from include/linux/seqlock.h:29,

                 from include/linux/time.h:8,

                 from include/linux/stat.h:60,

                 from include/linux/module.h:10,

                 from /home/administrator/Desktop/share/G100-S3C6410/wireless/rt73_linux_sta_drv1.1.0.3/Module/rt_config.h:63,

                 from /home/administrator/Desktop/share/G100-S3C6410/wireless/rt73_linux_sta_drv1.1.0.3/Module/rtmp_main.c:40:

/home/administrator/Desktop/share/G100-S3C6410/kernel/linux-2.6.29-co/arch/arm/include/asm/fpstate.h:32:5: warning: "__LINUX_ARM_ARCH__" is not defined

In file included from include/linux/spinlock.h:353,

                 from include/linux/seqlock.h:29,

                 from include/linux/time.h:8,

                 from include/linux/stat.h:60,

                 from include/linux/module.h:10,

                 from /home/administrator/Desktop/share/G100-S3C6410/wireless/rt73_linux_sta_drv1.1.0.3/Module/rt_config.h:63,

                 from /home/administrator/Desktop/share/G100-S3C6410/wireless/rt73_linux_sta_drv1.1.0.3/Module/rtmp_main.c:40:

/home/administrator/Desktop/share/G100-S3C6410/kernel/linux-2.6.29-co/arch/arm/include/asm/atomic.h:24:5: warning: "__LINUX_ARM_ARCH__" is not defined

In file included from include/linux/time.h:9,

                 from include/linux/stat.h:60,

                 from include/linux/module.h:10,

                 from /home/administrator/Desktop/share/G100-S3C6410/wireless/rt73_linux_sta_drv1.1.0.3/Module/rt_config.h:63,

                 from /home/administrator/Desktop/share/G100-S3C6410/wireless/rt73_linux_sta_drv1.1.0.3/Module/rtmp_main.c:40:

include/linux/math64.h: In function 'div_u64_rem':

include/linux/math64.h:43: error: '__LINUX_ARM_ARCH__' undeclared (first use in this function)

include/linux/math64.h:43: error: (Each undeclared identifier is reported only once

include/linux/math64.h:43: error: for each function it appears in.)

In file included from include/linux/gfp.h:4,

                 from include/linux/kmod.h:22,

                 from include/linux/module.h:13,

                 from /home/administrator/Desktop/share/G100-S3C6410/wireless/rt73_linux_sta_drv1.1.0.3/Module/rt_config.h:63,

                 from /home/administrator/Desktop/share/G100-S3C6410/wireless/rt73_linux_sta_drv1.1.0.3/Module/rtmp_main.c:40:

include/linux/mmzone.h:18:26: error: linux/bounds.h: No such file or directory

In file included from /home/administrator/Desktop/share/G100-S3C6410/kernel/linux-2.6.29-co/arch/arm/include/asm/page.h:189,

                 from include/linux/mmzone.h:20,

                 from include/linux/gfp.h:4,

                 from include/linux/kmod.h:22,

                 from include/linux/module.h:13,

                 from /home/administrator/Desktop/share/G100-S3C6410/wireless/rt73_linux_sta_drv1.1.0.3/Module/rt_config.h:63,

                 from /home/administrator/Desktop/share/G100-S3C6410/wireless/rt73_linux_sta_drv1.1.0.3/Module/rtmp_main.c:40:

/home/administrator/Desktop/share/G100-S3C6410/kernel/linux-2.6.29-co/arch/arm/include/asm/memory.h:18:25: error: mach/memory.h: No such file or directory

In file included from /home/administrator/Desktop/share/G100-S3C6410/kernel/linux-2.6.29-co/arch/arm/include/asm/page.h:189,

                 from include/linux/mmzone.h:20,

                 from include/linux/gfp.h:4,

                 from include/linux/kmod.h:22,

                 from include/linux/module.h:13,

                 from /home/administrator/Desktop/share/G100-S3C6410/wireless/rt73_linux_sta_drv1.1.0.3/Module/rt_config.h:63,

                 from /home/administrator/Desktop/share/G100-S3C6410/wireless/rt73_linux_sta_drv1.1.0.3/Module/rtmp_main.c:40:

/home/administrator/Desktop/share/G100-S3C6410/kernel/linux-2.6.29-co/arch/arm/include/asm/memory.h: In function 'virt_to_phys':

/home/administrator/Desktop/share/G100-S3C6410/kernel/linux-2.6.29-co/arch/arm/include/asm/memory.h:163: error: 'CONFIG_DRAM_BASE' undeclared (first use in this function)

/home/administrator/Desktop/share/G100-S3C6410/kernel/linux-2.6.29-co/arch/arm/include/asm/memory.h: In function 'phys_to_virt':

/home/administrator/Desktop/share/G100-S3C6410/kernel/linux-2.6.29-co/arch/arm/include/asm/memory.h:168: error: 'CONFIG_DRAM_BASE' undeclared (first use in this function)

/home/administrator/Desktop/share/G100-S3C6410/kernel/linux-2.6.29-co/arch/arm/include/asm/memory.h: In function 'virt_to_bus':

/home/administrator/Desktop/share/G100-S3C6410/kernel/linux-2.6.29-co/arch/arm/include/asm/memory.h:191: error: 'CONFIG_DRAM_BASE' undeclared (first use in this function)

/home/administrator/Desktop/share/G100-S3C6410/kernel/linux-2.6.29-co/arch/arm/include/asm/memory.h: In function 'bus_to_virt':

/home/administrator/Desktop/share/G100-S3C6410/kernel/linux-2.6.29-co/arch/arm/include/asm/memory.h:196: error: 'CONFIG_DRAM_BASE' undeclared (first use in this function)

In file included from include/linux/gfp.h:4,

                 from include/linux/kmod.h:22,

                 from include/linux/module.h:13,

                 from /home/administrator/Desktop/share/G100-S3C6410/wireless/rt73_linux_sta_drv1.1.0.3/Module/rt_config.h:63,

                 from /home/administrator/Desktop/share/G100-S3C6410/wireless/rt73_linux_sta_drv1.1.0.3/Module/rtmp_main.c:40:

include/linux/mmzone.h:256:5: warning: "MAX_NR_ZONES" is not defined

In file included from include/linux/gfp.h:4,

                 from include/linux/kmod.h:22,

                 from include/linux/module.h:13,

                 from /home/administrator/Desktop/share/G100-S3C6410/wireless/rt73_linux_sta_drv1.1.0.3/Module/rt_config.h:63,

                 from /home/administrator/Desktop/share/G100-S3C6410/wireless/rt73_linux_sta_drv1.1.0.3/Module/rtmp_main.c:40:

include/linux/mmzone.h: At top level:

include/linux/mmzone.h:290: error: 'MAX_NR_ZONES' undeclared here (not in a function)

In file included from include/linux/notifier.h:14,

                 from include/linux/memory_hotplug.h:6,

                 from include/linux/mmzone.h:644,

                 from include/linux/gfp.h:4,

                 from include/linux/kmod.h:22,

                 from include/linux/module.h:13,

                 from /home/administrator/Desktop/share/G100-S3C6410/wireless/rt73_linux_sta_drv1.1.0.3/Module/rt_config.h:63,

                 from /home/administrator/Desktop/share/G100-S3C6410/wireless/rt73_linux_sta_drv1.1.0.3/Module/rtmp_main.c:40:

include/linux/rwsem.h:22:65: error: asm/rwsem.h: No such file or directory

In file included from include/linux/memory_hotplug.h:6,

                 from include/linux/mmzone.h:644,

                 from include/linux/gfp.h:4,

                 from include/linux/kmod.h:22,

                 from include/linux/module.h:13,

                 from /home/administrator/Desktop/share/G100-S3C6410/wireless/rt73_linux_sta_drv1.1.0.3/Module/rt_config.h:63,

                 from /home/administrator/Desktop/share/G100-S3C6410/wireless/rt73_linux_sta_drv1.1.0.3/Module/rtmp_main.c:40:

include/linux/notifier.h:62: error: field 'rwsem' has incomplete type

In file included from include/linux/tracepoint.h:18,

                 from include/linux/module.h:19,

                 from /home/administrator/Desktop/share/G100-S3C6410/wireless/rt73_linux_sta_drv1.1.0.3/Module/rt_config.h:63,

                 from /home/administrator/Desktop/share/G100-S3C6410/wireless/rt73_linux_sta_drv1.1.0.3/Module/rtmp_main.c:40:

include/linux/rcupdate.h:65:2: error: #error "Unknown RCU implementation specified to kernel configuration"

In file included from include/linux/module.h:19,

                 from /home/administrator/Desktop/share/G100-S3C6410/wireless/rt73_linux_sta_drv1.1.0.3/Module/rt_config.h:63,

                 from /home/administrator/Desktop/share/G100-S3C6410/wireless/rt73_linux_sta_drv1.1.0.3/Module/rtmp_main.c:40:

include/linux/tracepoint.h: In function 'tracepoint_synchronize_unregister':

include/linux/tracepoint.h:153: error: implicit declaration of function '__synchronize_sched'

In file included from /home/administrator/Desktop/share/G100-S3C6410/wireless/rt73_linux_sta_drv1.1.0.3/Module/rtmp_main.c:40:

/home/administrator/Desktop/share/G100-S3C6410/wireless/rt73_linux_sta_drv1.1.0.3/Module/rt_config.h:64:27: error: linux/version.h: No such file or directory

In file included from include/linux/timex.h:170,

                 from include/linux/jiffies.h:8,

                 from include/linux/ktime.h:25,

                 from include/linux/timer.h:5,

                 from /home/administrator/Desktop/share/G100-S3C6410/wireless/rt73_linux_sta_drv1.1.0.3/Module/rt_config.h:69,

                 from /home/administrator/Desktop/share/G100-S3C6410/wireless/rt73_linux_sta_drv1.1.0.3/Module/rtmp_main.c:40:

/home/administrator/Desktop/share/G100-S3C6410/kernel/linux-2.6.29-co/arch/arm/include/asm/timex.h:15:24: error: mach/timex.h: No such file or directory

In file included from include/linux/ktime.h:25,

                 from include/linux/timer.h:5,

                 from /home/administrator/Desktop/share/G100-S3C6410/wireless/rt73_linux_sta_drv1.1.0.3/Module/rt_config.h:69,

                 from /home/administrator/Desktop/share/G100-S3C6410/wireless/rt73_linux_sta_drv1.1.0.3/Module/rtmp_main.c:40:

include/linux/jiffies.h:18:5: warning: "CONFIG_HZ" is not defined

include/linux/jiffies.h:20:7: warning: "CONFIG_HZ" is not defined

include/linux/jiffies.h:22:7: warning: "CONFIG_HZ" is not defined

include/linux/jiffies.h:24:7: warning: "CONFIG_HZ" is not defined

include/linux/jiffies.h:26:7: warning: "CONFIG_HZ" is not defined

include/linux/jiffies.h:28:7: warning: "CONFIG_HZ" is not defined

include/linux/jiffies.h:30:7: warning: "CONFIG_HZ" is not defined

include/linux/jiffies.h:32:7: warning: "CONFIG_HZ" is not defined

include/linux/jiffies.h:34:7: warning: "CONFIG_HZ" is not defined

include/linux/jiffies.h:36:7: warning: "CONFIG_HZ" is not defined

include/linux/jiffies.h:39:3: error: #error Invalid value of HZ.

include/linux/jiffies.h:257:31: warning: "CLOCK_TICK_RATE" is not defined

include/linux/jiffies.h:257:31: warning: "CLOCK_TICK_RATE" is not defined

include/linux/jiffies.h:257:31: warning: "CONFIG_HZ" is not defined

include/linux/jiffies.h:257:31: warning: "CONFIG_HZ" is not defined

include/linux/jiffies.h:257:31: error: division by zero in #if

include/linux/jiffies.h:257:31: error: division by zero in #if

include/linux/jiffies.h:257:31: warning: "CLOCK_TICK_RATE" is not defined

include/linux/jiffies.h:257:31: warning: "CLOCK_TICK_RATE" is not defined

include/linux/jiffies.h:257:31: warning: "CONFIG_HZ" is not defined

include/linux/jiffies.h:257:31: warning: "CONFIG_HZ" is not defined

include/linux/jiffies.h:257:31: error: division by zero in #if

include/linux/jiffies.h:257:31: error: division by zero in #if

include/linux/jiffies.h:257:31: warning: "CLOCK_TICK_RATE" is not defined

include/linux/jiffies.h:257:31: warning: "CONFIG_HZ" is not defined

include/linux/jiffies.h:257:31: warning: "CONFIG_HZ" is not defined

include/linux/jiffies.h:257:31: error: division by zero in #if

include/linux/jiffies.h:257:31: warning: "CLOCK_TICK_RATE" is not defined

include/linux/jiffies.h:257:31: warning: "CONFIG_HZ" is not defined

include/linux/jiffies.h:257:31: warning: "CONFIG_HZ" is not defined

include/linux/jiffies.h:257:31: error: division by zero in #if

include/linux/jiffies.h:257:31: error: division by zero in #if

include/linux/jiffies.h:257:31: error: division by zero in #if

include/linux/jiffies.h:257:31: warning: "CLOCK_TICK_RATE" is not defined

include/linux/jiffies.h:257:31: warning: "CLOCK_TICK_RATE" is not defined

include/linux/jiffies.h:257:31: warning: "CONFIG_HZ" is not defined

include/linux/jiffies.h:257:31: warning: "CONFIG_HZ" is not defined

include/linux/jiffies.h:257:31: error: division by zero in #if

include/linux/jiffies.h:257:31: error: division by zero in #if

include/linux/jiffies.h:257:31: warning: "CLOCK_TICK_RATE" is not defined

include/linux/jiffies.h:257:31: warning: "CLOCK_TICK_RATE" is not defined

include/linux/jiffies.h:257:31: warning: "CONFIG_HZ" is not defined

include/linux/jiffies.h:257:31: warning: "CONFIG_HZ" is not defined

include/linux/jiffies.h:257:31: error: division by zero in #if

include/linux/jiffies.h:257:31: error: division by zero in #if

include/linux/jiffies.h:257:31: warning: "CLOCK_TICK_RATE" is not defined

include/linux/jiffies.h:257:31: warning: "CONFIG_HZ" is not defined

include/linux/jiffies.h:257:31: warning: "CONFIG_HZ" is not defined

include/linux/jiffies.h:257:31: error: division by zero in #if

include/linux/jiffies.h:257:31: warning: "CLOCK_TICK_RATE" is not defined

include/linux/jiffies.h:257:31: warning: "CONFIG_HZ" is not defined

include/linux/jiffies.h:257:31: warning: "CONFIG_HZ" is not defined

include/linux/jiffies.h:257:31: error: division by zero in #if

include/linux/jiffies.h:257:31: error: division by zero in #if

include/linux/jiffies.h:257:31: error: division by zero in #if

include/linux/jiffies.h:257:31: warning: "CLOCK_TICK_RATE" is not defined

include/linux/jiffies.h:257:31: warning: "CLOCK_TICK_RATE" is not defined

include/linux/jiffies.h:257:31: warning: "CONFIG_HZ" is not defined

include/linux/jiffies.h:257:31: warning: "CONFIG_HZ" is not defined

include/linux/jiffies.h:257:31: error: division by zero in #if

include/linux/jiffies.h:257:31: error: division by zero in #if

include/linux/jiffies.h:257:31: warning: "CLOCK_TICK_RATE" is not defined

include/linux/jiffies.h:257:31: warning: "CLOCK_TICK_RATE" is not defined

include/linux/jiffies.h:257:31: warning: "CONFIG_HZ" is not defined

include/linux/jiffies.h:257:31: warning: "CONFIG_HZ" is not defined

include/linux/jiffies.h:257:31: error: division by zero in #if

include/linux/jiffies.h:257:31: error: division by zero in #if

include/linux/jiffies.h:257:31: warning: "CLOCK_TICK_RATE" is not defined

include/linux/jiffies.h:257:31: warning: "CONFIG_HZ" is not defined

include/linux/jiffies.h:257:31: warning: "CONFIG_HZ" is not defined

include/linux/jiffies.h:257:31: error: division by zero in #if

include/linux/jiffies.h:257:31: warning: "CLOCK_TICK_RATE" is not defined

include/linux/jiffies.h:257:31: warning: "CONFIG_HZ" is not defined

include/linux/jiffies.h:257:31: warning: "CONFIG_HZ" is not defined

include/linux/jiffies.h:257:31: error: division by zero in #if

include/linux/jiffies.h:257:31: error: division by zero in #if

include/linux/jiffies.h:257:31: warning: "CLOCK_TICK_RATE" is not defined

include/linux/jiffies.h:257:31: warning: "CLOCK_TICK_RATE" is not defined

include/linux/jiffies.h:257:31: warning: "CONFIG_HZ" is not defined

include/linux/jiffies.h:257:31: warning: "CONFIG_HZ" is not defined

include/linux/jiffies.h:257:31: error: division by zero in #if

include/linux/jiffies.h:257:31: error: division by zero in #if

include/linux/jiffies.h:257:31: warning: "CLOCK_TICK_RATE" is not defined

include/linux/jiffies.h:257:31: warning: "CLOCK_TICK_RATE" is not defined

include/linux/jiffies.h:257:31: warning: "CONFIG_HZ" is not defined

include/linux/jiffies.h:257:31: warning: "CONFIG_HZ" is not defined

include/linux/jiffies.h:257:31: error: division by zero in #if

include/linux/jiffies.h:257:31: error: division by zero in #if

include/linux/jiffies.h:257:31: warning: "CLOCK_TICK_RATE" is not defined

include/linux/jiffies.h:257:31: warning: "CONFIG_HZ" is not defined

include/linux/jiffies.h:257:31: warning: "CONFIG_HZ" is not defined

include/linux/jiffies.h:257:31: error: division by zero in #if

include/linux/jiffies.h:257:31: warning: "CLOCK_TICK_RATE" is not defined

include/linux/jiffies.h:257:31: warning: "CONFIG_HZ" is not defined

include/linux/jiffies.h:257:31: warning: "CONFIG_HZ" is not defined

include/linux/jiffies.h:257:31: error: division by zero in #if

include/linux/jiffies.h:257:31: error: division by zero in #if

include/linux/jiffies.h:257:31: error: division by zero in #if

include/linux/jiffies.h:257:46: warning: "SHIFT_HZ" is not defined

In file included from include/linux/io.h:22,

                 from include/linux/pci.h:54,

                 from /home/administrator/Desktop/share/G100-S3C6410/wireless/rt73_linux_sta_drv1.1.0.3/Module/rt_config.h:73,

                 from /home/administrator/Desktop/share/G100-S3C6410/wireless/rt73_linux_sta_drv1.1.0.3/Module/rtmp_main.c:40:

/home/administrator/Desktop/share/G100-S3C6410/kernel/linux-2.6.29-co/arch/arm/include/asm/io.h:93:21: error: mach/io.h: No such file or directory

In file included from include/linux/pci.h:54,

                 from /home/administrator/Desktop/share/G100-S3C6410/wireless/rt73_linux_sta_drv1.1.0.3/Module/rt_config.h:73,

                 from /home/administrator/Desktop/share/G100-S3C6410/wireless/rt73_linux_sta_drv1.1.0.3/Module/rtmp_main.c:40:

include/linux/io.h: At top level:

include/linux/io.h:66: error: expected identifier or '(' before numeric constant

In file included from include/linux/pci.h:1057,

                 from /home/administrator/Desktop/share/G100-S3C6410/wireless/rt73_linux_sta_drv1.1.0.3/Module/rt_config.h:73,

                 from /home/administrator/Desktop/share/G100-S3C6410/wireless/rt73_linux_sta_drv1.1.0.3/Module/rtmp_main.c:40:

/home/administrator/Desktop/share/G100-S3C6410/kernel/linux-2.6.29-co/arch/arm/include/asm/pci.h:7:51: error: mach/hardware.h: No such file or directory

In file included from include/linux/irqnr.h:10,

                 from include/linux/random.h:12,

                 from include/linux/net.h:57,

                 from include/linux/skbuff.h:25,

                 from include/linux/if_ether.h:120,

                 from include/linux/netdevice.h:29,

                 from /home/administrator/Desktop/share/G100-S3C6410/wireless/rt73_linux_sta_drv1.1.0.3/Module/rt_config.h:74,

                 from /home/administrator/Desktop/share/G100-S3C6410/wireless/rt73_linux_sta_drv1.1.0.3/Module/rtmp_main.c:40:

/home/administrator/Desktop/share/G100-S3C6410/kernel/linux-2.6.29-co/arch/arm/include/asm/irq.h:4:23: error: mach/irqs.h: No such file or directory

In file included from include/linux/netdevice.h:34,

                 from /home/administrator/Desktop/share/G100-S3C6410/wireless/rt73_linux_sta_drv1.1.0.3/Module/rt_config.h:74,

                 from /home/administrator/Desktop/share/G100-S3C6410/wireless/rt73_linux_sta_drv1.1.0.3/Module/rtmp_main.c:40:

include/linux/delay.h: In function 'ndelay':

include/linux/delay.h:39: error: 'CONFIG_HZ' undeclared (first use in this function)

In file included from include/linux/hardirq.h:8,

                 from include/linux/interrupt.h:12,

                 from include/linux/netdevice.h:1027,

                 from /home/administrator/Desktop/share/G100-S3C6410/wireless/rt73_linux_sta_drv1.1.0.3/Module/rt_config.h:74,

                 from /home/administrator/Desktop/share/G100-S3C6410/wireless/rt73_linux_sta_drv1.1.0.3/Module/rtmp_main.c:40:

/home/administrator/Desktop/share/G100-S3C6410/kernel/linux-2.6.29-co/arch/arm/include/asm/hardirq.h:15:5: warning: "NR_IRQS" is not defined

/home/administrator/Desktop/share/G100-S3C6410/kernel/linux-2.6.29-co/arch/arm/include/asm/hardirq.h:26:27: warning: "NR_IRQS" is not defined

In file included from include/linux/sched.h:61,

                 from include/linux/interrupt.h:13,

                 from include/linux/netdevice.h:1027,

                 from /home/administrator/Desktop/share/G100-S3C6410/wireless/rt73_linux_sta_drv1.1.0.3/Module/rt_config.h:74,

                 from /home/administrator/Desktop/share/G100-S3C6410/wireless/rt73_linux_sta_drv1.1.0.3/Module/rtmp_main.c:40:

include/linux/mm_types.h:26:5: warning: "CONFIG_SPLIT_PTLOCK_CPUS" is not defined

include/linux/mm_types.h:70:5: warning: "CONFIG_SPLIT_PTLOCK_CPUS" is not defined

In file included from include/linux/sched.h:61,

                 from include/linux/interrupt.h:13,

                 from include/linux/netdevice.h:1027,

                 from /home/administrator/Desktop/share/G100-S3C6410/wireless/rt73_linux_sta_drv1.1.0.3/Module/rt_config.h:74,

                 from /home/administrator/Desktop/share/G100-S3C6410/wireless/rt73_linux_sta_drv1.1.0.3/Module/rtmp_main.c:40:

include/linux/mm_types.h: At top level:

include/linux/mm_types.h:206: error: field 'mmap_sem' has incomplete type

In file included from include/linux/interrupt.h:13,

                 from include/linux/netdevice.h:1027,

                 from /home/administrator/Desktop/share/G100-S3C6410/wireless/rt73_linux_sta_drv1.1.0.3/Module/rt_config.h:74,

                 from /home/administrator/Desktop/share/G100-S3C6410/wireless/rt73_linux_sta_drv1.1.0.3/Module/rtmp_main.c:40:

include/linux/sched.h:357:5: warning: "CONFIG_SPLIT_PTLOCK_CPUS" is not defined

In file included from include/linux/fs.h:399,

                 from include/linux/proc_fs.h:5,

                 from /home/administrator/Desktop/share/G100-S3C6410/wireless/rt73_linux_sta_drv1.1.0.3/Module/rt_config.h:79,

                 from /home/administrator/Desktop/share/G100-S3C6410/wireless/rt73_linux_sta_drv1.1.0.3/Module/rtmp_main.c:40:

include/linux/quota.h:376: error: field 'dqptr_sem' has incomplete type

In file included from include/linux/proc_fs.h:5,

                 from /home/administrator/Desktop/share/G100-S3C6410/wireless/rt73_linux_sta_drv1.1.0.3/Module/rt_config.h:79,

                 from /home/administrator/Desktop/share/G100-S3C6410/wireless/rt73_linux_sta_drv1.1.0.3/Module/rtmp_main.c:40:

include/linux/fs.h:674: error: field 'i_alloc_sem' has incomplete type

In file included from include/linux/proc_fs.h:5,

                 from /home/administrator/Desktop/share/G100-S3C6410/wireless/rt73_linux_sta_drv1.1.0.3/Module/rt_config.h:79,

                 from /home/administrator/Desktop/share/G100-S3C6410/wireless/rt73_linux_sta_drv1.1.0.3/Module/rtmp_main.c:40:

include/linux/fs.h:1147: error: field 's_umount' has incomplete type

In file included from /home/administrator/Desktop/share/G100-S3C6410/wireless/rt73_linux_sta_drv1.1.0.3/Module/rtmp_main.c:40:

/home/administrator/Desktop/share/G100-S3C6410/wireless/rt73_linux_sta_drv1.1.0.3/Module/rt_config.h:93:5: warning: "LINUX_VERSION_CODE" is not defined

In file included from /home/administrator/Desktop/share/G100-S3C6410/wireless/rt73_linux_sta_drv1.1.0.3/Module/rt_config.h:212,

                 from /home/administrator/Desktop/share/G100-S3C6410/wireless/rt73_linux_sta_drv1.1.0.3/Module/rtmp_main.c:40:

/home/administrator/Desktop/share/G100-S3C6410/wireless/rt73_linux_sta_drv1.1.0.3/Module/rtmp.h:113:5: warning: "LINUX_VERSION_CODE" is not defined

/home/administrator/Desktop/share/G100-S3C6410/wireless/rt73_linux_sta_drv1.1.0.3/Module/rtmp.h:113:27: warning: "KERNEL_VERSION" is not defined

/home/administrator/Desktop/share/G100-S3C6410/wireless/rt73_linux_sta_drv1.1.0.3/Module/rtmp.h:113:41: error: missing binary operator before token "("

/home/administrator/Desktop/share/G100-S3C6410/wireless/rt73_linux_sta_drv1.1.0.3/Module/rtmp.h:119:5: warning: "LINUX_VERSION_CODE" is not defined

/home/administrator/Desktop/share/G100-S3C6410/wireless/rt73_linux_sta_drv1.1.0.3/Module/rtmp.h:119:26: warning: "KERNEL_VERSION" is not defined

/home/administrator/Desktop/share/G100-S3C6410/wireless/rt73_linux_sta_drv1.1.0.3/Module/rtmp.h:119:40: error: missing binary operator before token "("

/home/administrator/Desktop/share/G100-S3C6410/wireless/rt73_linux_sta_drv1.1.0.3/Module/rtmp.h:758:6: warning: "LINUX_VERSION_CODE" is not defined

/home/administrator/Desktop/share/G100-S3C6410/wireless/rt73_linux_sta_drv1.1.0.3/Module/rtmp.h:758:27: warning: "KERNEL_VERSION" is not defined

/home/administrator/Desktop/share/G100-S3C6410/wireless/rt73_linux_sta_drv1.1.0.3/Module/rtmp.h:758:41: error: missing binary operator before token "("

/home/administrator/Desktop/share/G100-S3C6410/wireless/rt73_linux_sta_drv1.1.0.3/Module/rtmp.h:797:5: warning: "LINUX_VERSION_CODE" is not defined

/home/administrator/Desktop/share/G100-S3C6410/wireless/rt73_linux_sta_drv1.1.0.3/Module/rtmp.h:797:27: warning: "KERNEL_VERSION" is not defined

/home/administrator/Desktop/share/G100-S3C6410/wireless/rt73_linux_sta_drv1.1.0.3/Module/rtmp.h:797:41: error: missing binary operator before token "("

/home/administrator/Desktop/share/G100-S3C6410/wireless/rt73_linux_sta_drv1.1.0.3/Module/rtmp.h:813:5: warning: "LINUX_VERSION_CODE" is not defined

/home/administrator/Desktop/share/G100-S3C6410/wireless/rt73_linux_sta_drv1.1.0.3/Module/rtmp.h:813:27: warning: "KERNEL_VERSION" is not defined

/home/administrator/Desktop/share/G100-S3C6410/wireless/rt73_linux_sta_drv1.1.0.3/Module/rtmp.h:813:41: error: missing binary operator before token "("

/home/administrator/Desktop/share/G100-S3C6410/wireless/rt73_linux_sta_drv1.1.0.3/Module/rtmp.h:2997:5: warning: "LINUX_VERSION_CODE" is not defined

/home/administrator/Desktop/share/G100-S3C6410/wireless/rt73_linux_sta_drv1.1.0.3/Module/rtmp.h:2997:26: warning: "KERNEL_VERSION" is not defined

/home/administrator/Desktop/share/G100-S3C6410/wireless/rt73_linux_sta_drv1.1.0.3/Module/rtmp.h:2997:40: error: missing binary operator before token "("

In file included from /home/administrator/Desktop/share/G100-S3C6410/wireless/rt73_linux_sta_drv1.1.0.3/Module/rtmp_main.c:40:

/home/administrator/Desktop/share/G100-S3C6410/wireless/rt73_linux_sta_drv1.1.0.3/Module/rt_config.h:238:5: warning: "LINUX_VERSION_CODE" is not defined

/home/administrator/Desktop/share/G100-S3C6410/wireless/rt73_linux_sta_drv1.1.0.3/Module/rtmp_main.c:45:5: warning: "LINUX_VERSION_CODE" is not defined

/home/administrator/Desktop/share/G100-S3C6410/wireless/rt73_linux_sta_drv1.1.0.3/Module/rtmp_main.c:46: error: expected ')' before string constant

/home/administrator/Desktop/share/G100-S3C6410/wireless/rt73_linux_sta_drv1.1.0.3/Module/rtmp_main.c:94:5: warning: "LINUX_VERSION_CODE" is not defined

/home/administrator/Desktop/share/G100-S3C6410/wireless/rt73_linux_sta_drv1.1.0.3/Module/rtmp_main.c:103: warning: initialization from incompatible pointer type

/home/administrator/Desktop/share/G100-S3C6410/wireless/rt73_linux_sta_drv1.1.0.3/Module/rtmp_main.c:104: warning: initialization from incompatible pointer type

/home/administrator/Desktop/share/G100-S3C6410/wireless/rt73_linux_sta_drv1.1.0.3/Module/rtmp_main.c:429:5: warning: "LINUX_VERSION_CODE" is not defined

/home/administrator/Desktop/share/G100-S3C6410/wireless/rt73_linux_sta_drv1.1.0.3/Module/rtmp_main.c: In function 'usb_rtusb_close_device':

/home/administrator/Desktop/share/G100-S3C6410/wireless/rt73_linux_sta_drv1.1.0.3/Module/rtmp_main.c:443: error: implicit declaration of function 'kill_proc'

/home/administrator/Desktop/share/G100-S3C6410/wireless/rt73_linux_sta_drv1.1.0.3/Module/rtmp_main.c:489:5: warning: "LINUX_VERSION_CODE" is not defined

/home/administrator/Desktop/share/G100-S3C6410/wireless/rt73_linux_sta_drv1.1.0.3/Module/rtmp_main.c: In function 'usb_rtusb_open':

/home/administrator/Desktop/share/G100-S3C6410/wireless/rt73_linux_sta_drv1.1.0.3/Module/rtmp_main.c:496: error: 'MOD_INC_USE_COUNT' undeclared (first use in this function)

/home/administrator/Desktop/share/G100-S3C6410/wireless/rt73_linux_sta_drv1.1.0.3/Module/rtmp_main.c: In function 'usb_rtusb_close':

/home/administrator/Desktop/share/G100-S3C6410/wireless/rt73_linux_sta_drv1.1.0.3/Module/rtmp_main.c:612: error: 'CONFIG_HZ' undeclared (first use in this function)

/home/administrator/Desktop/share/G100-S3C6410/wireless/rt73_linux_sta_drv1.1.0.3/Module/rtmp_main.c:647:5: warning: "LINUX_VERSION_CODE" is not defined

/home/administrator/Desktop/share/G100-S3C6410/wireless/rt73_linux_sta_drv1.1.0.3/Module/rtmp_main.c:650: error: 'MOD_DEC_USE_COUNT' undeclared (first use in this function)

/home/administrator/Desktop/share/G100-S3C6410/wireless/rt73_linux_sta_drv1.1.0.3/Module/rtmp_main.c:810:5: warning: "LINUX_VERSION_CODE" is not defined

/home/administrator/Desktop/share/G100-S3C6410/wireless/rt73_linux_sta_drv1.1.0.3/Module/rtmp_main.c: In function 'MlmeThread':

/home/administrator/Desktop/share/G100-S3C6410/wireless/rt73_linux_sta_drv1.1.0.3/Module/rtmp_main.c:811: error: too few arguments to function 'daemonize'

/home/administrator/Desktop/share/G100-S3C6410/wireless/rt73_linux_sta_drv1.1.0.3/Module/rtmp_main.c:815:5: warning: "LINUX_VERSION_CODE" is not defined

/home/administrator/Desktop/share/G100-S3C6410/wireless/rt73_linux_sta_drv1.1.0.3/Module/rtmp_main.c:862:5: warning: "LINUX_VERSION_CODE" is not defined

/home/administrator/Desktop/share/G100-S3C6410/wireless/rt73_linux_sta_drv1.1.0.3/Module/rtmp_main.c: In function 'RTUSBCmdThread':

/home/administrator/Desktop/share/G100-S3C6410/wireless/rt73_linux_sta_drv1.1.0.3/Module/rtmp_main.c:863: error: too few arguments to function 'daemonize'

/home/administrator/Desktop/share/G100-S3C6410/wireless/rt73_linux_sta_drv1.1.0.3/Module/rtmp_main.c:867:5: warning: "LINUX_VERSION_CODE" is not defined

/home/administrator/Desktop/share/G100-S3C6410/wireless/rt73_linux_sta_drv1.1.0.3/Module/rtmp_main.c:907:5: warning: "LINUX_VERSION_CODE" is not defined

/home/administrator/Desktop/share/G100-S3C6410/wireless/rt73_linux_sta_drv1.1.0.3/Module/rtmp_main.c: In function 'usb_rtusb_probe':

/home/administrator/Desktop/share/G100-S3C6410/wireless/rt73_linux_sta_drv1.1.0.3/Module/rtmp_main.c:937: error: 'MOD_DEC_USE_COUNT' undeclared (first use in this function)

/home/administrator/Desktop/share/G100-S3C6410/wireless/rt73_linux_sta_drv1.1.0.3/Module/rtmp_main.c:938: error: implicit declaration of function 'usb_dec_dev_use'

/home/administrator/Desktop/share/G100-S3C6410/wireless/rt73_linux_sta_drv1.1.0.3/Module/rtmp_main.c:942: error: 'struct net_device' has no member named 'priv'

/home/administrator/Desktop/share/G100-S3C6410/wireless/rt73_linux_sta_drv1.1.0.3/Module/rtmp_main.c:943: error: 'struct net_device' has no member named 'priv'

/home/administrator/Desktop/share/G100-S3C6410/wireless/rt73_linux_sta_drv1.1.0.3/Module/rtmp_main.c:955: warning: assignment from incompatible pointer type

/home/administrator/Desktop/share/G100-S3C6410/wireless/rt73_linux_sta_drv1.1.0.3/Module/rtmp_main.c:957: error: implicit declaration of function 'SET_MODULE_OWNER'

/home/administrator/Desktop/share/G100-S3C6410/wireless/rt73_linux_sta_drv1.1.0.3/Module/rtmp_main.c:961: error: 'struct net_device' has no member named 'open'

/home/administrator/Desktop/share/G100-S3C6410/wireless/rt73_linux_sta_drv1.1.0.3/Module/rtmp_main.c:962: error: 'struct net_device' has no member named 'hard_start_xmit'

/home/administrator/Desktop/share/G100-S3C6410/wireless/rt73_linux_sta_drv1.1.0.3/Module/rtmp_main.c:963: error: 'struct net_device' has no member named 'stop'

/home/administrator/Desktop/share/G100-S3C6410/wireless/rt73_linux_sta_drv1.1.0.3/Module/rtmp_main.c:964: error: 'struct net_device' has no member named 'priv'

/home/administrator/Desktop/share/G100-S3C6410/wireless/rt73_linux_sta_drv1.1.0.3/Module/rtmp_main.c:965: error: 'struct net_device' has no member named 'get_stats'

/home/administrator/Desktop/share/G100-S3C6410/wireless/rt73_linux_sta_drv1.1.0.3/Module/rtmp_main.c:967:5: warning: "LINUX_VERSION_CODE" is not defined

/home/administrator/Desktop/share/G100-S3C6410/wireless/rt73_linux_sta_drv1.1.0.3/Module/rtmp_main.c:968: error: 'struct net_device' has no member named 'get_wireless_stats'

/home/administrator/Desktop/share/G100-S3C6410/wireless/rt73_linux_sta_drv1.1.0.3/Module/rtmp_main.c:970: error: 'struct net_device' has no member named 'wireless_handlers'

/home/administrator/Desktop/share/G100-S3C6410/wireless/rt73_linux_sta_drv1.1.0.3/Module/rtmp_main.c:972: error: 'struct net_device' has no member named 'do_ioctl'

/home/administrator/Desktop/share/G100-S3C6410/wireless/rt73_linux_sta_drv1.1.0.3/Module/rtmp_main.c:977: error: 'struct net_device' has no member named 'weight'

/home/administrator/Desktop/share/G100-S3C6410/wireless/rt73_linux_sta_drv1.1.0.3/Module/rtmp_main.c:985: warning: initialization from incompatible pointer type

/home/administrator/Desktop/share/G100-S3C6410/wireless/rt73_linux_sta_drv1.1.0.3/Module/rtmp_main.c:995: error: 'dev_base' undeclared (first use in this function)

/home/administrator/Desktop/share/G100-S3C6410/wireless/rt73_linux_sta_drv1.1.0.3/Module/rtmp_main.c:995: error: 'struct net_device' has no member named 'next'

/home/administrator/Desktop/share/G100-S3C6410/wireless/rt73_linux_sta_drv1.1.0.3/Module/rtmp_main.c:1019: error: 'struct usb_interface' has no member named 'act_altsetting'

/home/administrator/Desktop/share/G100-S3C6410/wireless/rt73_linux_sta_drv1.1.0.3/Module/rtmp_main.c:1020: error: 'struct usb_interface_descriptor' has no member named 'endpoint'

/home/administrator/Desktop/share/G100-S3C6410/wireless/rt73_linux_sta_drv1.1.0.3/Module/rtmp_main.c: In function 'usb_rtusb_disconnect':

/home/administrator/Desktop/share/G100-S3C6410/wireless/rt73_linux_sta_drv1.1.0.3/Module/rtmp_main.c:1062: error: 'CONFIG_HZ' undeclared (first use in this function)

/home/administrator/Desktop/share/G100-S3C6410/wireless/rt73_linux_sta_drv1.1.0.3/Module/rtmp_main.c:1082: error: 'MOD_IN_USE' undeclared (first use in this function)

/home/administrator/Desktop/share/G100-S3C6410/wireless/rt73_linux_sta_drv1.1.0.3/Module/rtmp_main.c:1083: error: 'MOD_DEC_USE_COUNT' undeclared (first use in this function)

/home/administrator/Desktop/share/G100-S3C6410/wireless/rt73_linux_sta_drv1.1.0.3/Module/rtmp_main.c: In function 'usb_rtusb_exit':

/home/administrator/Desktop/share/G100-S3C6410/wireless/rt73_linux_sta_drv1.1.0.3/Module/rtmp_main.c:1338: error: 'CONFIG_HZ' undeclared (first use in this function)

make[2]: *** [/home/administrator/Desktop/share/G100-S3C6410/wireless/rt73_linux_sta_drv1.1.0.3/Module/rtmp_main.o] Error 1

make[1]: *** [_module_/home/administrator/Desktop/share/G100-S3C6410/wireless/rt73_linux_sta_drv1.1.0.3/Module] Error 2

make[1]: Leaving directory `/home/administrator/Desktop/share/G100-S3C6410/kernel/linux-2.6.29-co'

make: *** [all] Error 2 



몇 일째 무선랜 드라이버 포팅 때문에 진행이 안되고 있습니다. 방법이 없을까요?


아니면 G100 용으로 무선랜 드라이버 포팅해놓으신게 있으시면, 보내주시면 감사하겠습니다.




이 게시물을
  • Twitter
  • Facebook
  • Delicious
목록

댓글 0

목록
번호 제목 글쓴이 날짜 조회 수
공지 포럼의 메뉴가 보이지 않아요! 장길석 2014.02.06 957631
공지 [중요 공지]제품 사용 및 기술 문의는 전화 상담을 받지 않습니다. 장길석 2012.11.09 1408527
공지 답글에 대한 공지 사항. falinux 2006.11.20 2424021
15341 [특판][성Y인Y용Y품][비아][시알][여성흥분제] 전부 1+1 vv8282.top 지금 확인해보세요~! dde33 2026.10.15 2
15340 요즘 잘 나가는,,, dde33 2026.09.12 843
15339 buildroot 사용 관련 로즈마리 2021.02.01 38166
15338 GPIO 제어 방법 문의 [1] 단순최고 2021.01.25 51084
15337 임베디드 리눅스 개발 보드 추천 nam 2019.12.06 48863
15336 make wandboard_quad 실행시 문제 gasi 2019.08.27 47084
15335 LCD 초기화 코드 좀 봐주세요 [1] 김용수 2019.07.12 63135
15334 임베디드 리눅스 커널 소스에 관해 질문드립니다 ! ekthatkxkd 2019.06.28 43727
15333 numpy,scipy 를 arm-linux-XXXX 로 크로스컴파일 하여 올릴수 있나요? 초보자 2019.06.24 49287
15332 I2C - deal with arbitration loss 오류가 궁금합니다. [1] S1eepingBeauty 2018.12.10 56770
15331 구형 EM-PXA270 보드 혹시 보유하시분 연락 주시면 감사드릴께요. file 존 2018.11.24 42753
15330 리눅스 GPIO 관련 센서의 단선 또는 고장유무 판별법이 궁금합니다. [2] S1eepingBeauty 2018.11.12 55125
15329 임베디드 리눅스에서 c 언어 디버깅 궁금합니다. [1] 존 2018.09.14 47072
15328 부팅 시간 문의 [1] nam 2018.06.29 45791
15327 localport? port? 검은고래 2018.06.29 39957
15326 fork()의 thread 멈추는 현상 [4] HwangRoy 2018.05.09 58614
15325 임베디드 리눅스 습득용 보드 판매하시나요? 임베디드초급자 2018.04.27 39719
15324 (도와주세요)네트워크 디바이스 드라이버 수정문제입니다. [1] Chanmini 2018.03.04 43600
15323 Ez x5 구합니다!! khobaik 2018.01.26 38315
15322 실행중 symbol not found 를 발생시키는 u-boot 본적 있으신가요 ? sayyouandme 2017.12.17 57347
첫 페이지 1 2 3 4 5 6 7 8 9 10 끝 페이지
쓰기
태그
부탁드립니다. ^^
  • 글을 작성하시려면 회원으로 가입하시고 로그인 하셔야 합니다.
  • 회원 가입은 주민등록번호가 필요 없으며, 메일 주소만 있으면 간단하게 가입하실 수 있습니다.
  • 본 포럼에 등록된 모든 글의 저작권은 작성하신 분께 있으며, 저작자의 허락 없이 다른 곳에 펌이나 도용하시면 안 됩니다.
  • 또한, 전자우편 수집 프로그램이나 그 밖의 기술적 장치를 이용하여 무단으로 이메일 주소 및 자료 수집되는 것을 거부하며,
  • 이를 위반 시 정보통신망 법에 의해 형사 처벌됨을 유념하시기 바랍니다.
  • FF 포럼
  • 강좌 & 팁
  • 함수설명
  • 자료실
  • 도와주세요