logo
한국어 Select Language
FF 포럼
포럼지기에게 한 마디
공지사항
뉴스 EZ보드 통합 메뉴얼
FA-VUS 개발환경 !강추! 타켓보드 부팅-HyperTerminal 타켓보드 부팅-Tutty 타켓보드 부팅-minicom Windows환경-타겟 Linux 구동 Linux환경-타겟 Linux 구동 개발 시스템 구축 유형 페도라 설치 CentOS 설치 크로스 컴파일러 설치 TFTP 환경 구축 NFS 파일 시스템 구축 삼바 서버 구축 부트로더 부트로더 쓰기 커널 이미지 제작 및 설치 램디스크 이미지 제작 및 설치
임베디드 제품 사용기 오늘의 영어 휴게실 Appliance
강좌 & 팁
강좌 & 팁 EZ-보드 그래픽 & 멀티미디어 네트워크 프로그래밍 디바이스 드라이버 ImJa 솔루션 임베디드 FLEX 안드로이드 iOS 개발 FAIDE 하드웨어 C/C++ go언어 GNU C 레퍼런스 메뉴얼 ARM 루아 응용 프로젝트 이클립스 지그비 개발자 노트 권장도서 FPGA
VIVADO DSP HSIO Logic Zynq
함수설명
C 라이브러리 함수 커널 API 그래픽 라이브러리 - gxLib
자료실
자료실 FALINUX SDK ARM PC-V210 S3C6410
G100-S3C6410 S100-S3C6410 C221-S3C6410 N200-S3C6410 EZ-S3C6410
S5PV210
G100-S5PV210 S100-S5PV210 N200-S5PV210 C221-S5PV210
EZ-S3C2440 EZ-PXA270 EZ-X5 EZ-S2410 Auto Package
도와주세요
FAQ 도와주세요

  • 회원가입
  • ID/PW 찾기
 
  1. FAQ

  2. 도와주세요


최근 글

  • [특판][성Y인Y용Y품][...
  • 요즘 잘 나가는,,,
  • 요즘은 vmware 말고 ...
  • [docker] buildx 를 ...
  • buildroot 사용 관련
  • GPIO 제어 방법 문의 [1]
  • 임베디드 리눅스 개발...
  • make wandboard_quad ...
  • LCD 초기화 코드 좀 ... [1]
  • 임베디드 리눅스 커널...

최근 댓글

  • 오래 전에 해결법을 터득해서 ...
  • 비트 코인으로 작업하는 것은 ...
  • 10년차 임베 엔지니어 입니다. ...
  • 임베디드쪽이라면 SOC 쪽 displ...
  • 그렇군요 제가 질문이 잘못됬었...
  • 취준생으로서 포트폴리오를 만...
  • 제가 현재 취업준비생입니다. ...
  • 에프에이리눅스 보드는 아래 링...
  • 전체
  • 일반
  • X5
  • S2410
  • ESP-NS
  • S3C2440
  • EP9312
  • 구매
  • 기타

X5 [re] 커널 컴파일에서 자꾸 에러가 납니다

2006.01.17 22:06

장형기 조회 수:8344

안녕하세요...

학습을 위하여 커널 패치를 한것인가요?? 아니면 메뉴얼 대로 따라하기를 하시는 중인가요??
먼저 메뉴얼대로 하시면 대부분이 에러가 발생합니다. 저희도 따라하기를 하면 5번중 1~2번 성공합니다.
대부분이 오타이거나 어떤 부분을 빠뜨린 경우입니다.
첫번째 학습의 경우에는 패치가 모두된 커널을 가지고, 저희가 어떤 부분에 패치를 하였는지를 거꾸로 찾아 보는 방법이 제일 빠릅니다.
두번째의 경우에는 제공된 CD의 sw/kernel/linux-2.4.19-x5-v07.tar.gz 의 파일을 압축을 푸시고 바로 사용하시면 됩니다. 이미 모든 패치가 된 커널입니다. 아니면 홈페이지의 자료실에서 커널을 다운받으시면 됩니다.

그럼 수고하세요..




>EZ-X5를 구매했구요, 메뉴얼에 적힌대로 실행해보고 있는데요,
>
>커널을 컴파일 하는데서 문제가 발생했습니다.
>
>메뉴얼 116쪽의 make ez-x5_config 랑 make oldconfig 는 잘 됐습니다.
>그런데 그 다음 페이지의 커널 컴파일 옵션을 수정할 수 있는 부분에서부터 막히더라구요
>make menuconfig 라고 치면,
>
>(생략)
>checklist.c:343: warning: incompatible implicit declaration of built-in function ‘fprintf’
>checklist.c:345: warning: incompatible implicit declaration of built-in function ‘fprintf’
>make[1]: *** [checklist.o] 오류 1
>make[1]: Leaving directory `/project/ez-x5/test/kernel/linux-2.4.19-rmk7-pxa1-ez-x5/scripts/lxdialog'
>make: *** [menuconfig] 오류 2
>
>이런 에러가 뜹니다. 그래도 이건 옵션이니까 일단 스킵하고 넘어갔는데그 다음에 119쪽에 나오는
>make dep, make clean, make zImage 를 해보면
>차마 에러가 너무 길어서 다 올릴 순 없고, make zImage를 쳤을 때의 에러만 보이자면
>
>[root@serene linux]# make zImage
>. scripts/mkversion > .tmpversion
>armv5l-linux-gcc -D__KERNEL__ -I/project/ez-x5/test/kernel/linux-2.4.19-rmk7-pxa1-ez-x5/include -Wall -Wstrict-prototypes -Wno-trigraphs -O2 -fno-strict-aliasing -fno-common -Uarm -fno-common -pipe -mapcs-32 -D__LINUX_ARM_ARCH__=3 -march=armv3  -mshort-load-bytes -msoft-float -Uarm  -DUTS_MACHINE='"arm"' -DKBUILD_BASENAME=version -c -o init/version.o init/version.c
>make[1]: Entering directory `/project/ez-x5/test/kernel/linux-2.4.19-rmk7-pxa1-ez-x5/arch/arm/tools'
>cmp constants.h /project/ez-x5/test/kernel/linux-2.4.19-rmk7-pxa1-ez-x5/include/asm-arm/constants.h >/dev/null 2>&1 || cp -p constants.h /project/ez-x5/test/kernel/linux-2.4.19-rmk7-pxa1-ez-x5/include/asm-arm/constants.h
>make[1]: Leaving directory `/project/ez-x5/test/kernel/linux-2.4.19-rmk7-pxa1-ez-x5/arch/arm/tools'
>make CFLAGS="-D__KERNEL__ -I/project/ez-x5/test/kernel/linux-2.4.19-rmk7-pxa1-ez-x5/include -Wall -Wstrict-prototypes -Wno-trigraphs -O2 -fno-strict-aliasing -fno-common -Uarm -fno-common -pipe -mapcs-32 -D__LINUX_ARM_ARCH__=3 -march=armv3  -mshort-load-bytes -msoft-float -Uarm " -C  kernelmake[1]: Entering directory `/project/ez-x5/test/kernel/linux-2.4.19-rmk7-pxa1-ez-x5/kernel'
>make all_targets
>make[2]: Entering directory `/project/ez-x5/test/kernel/linux-2.4.19-rmk7-pxa1-ez-x5/kernel'
>make[2]: `all_targets'를 위해 할 일이 없습니다
>make[2]: Leaving directory `/project/ez-x5/test/kernel/linux-2.4.19-rmk7-pxa1-ez-x5/kernel'
>make[1]: Leaving directory `/project/ez-x5/test/kernel/linux-2.4.19-rmk7-pxa1-ez-x5/kernel'
>make CFLAGS="-D__KERNEL__ -I/project/ez-x5/test/kernel/linux-2.4.19-rmk7-pxa1-ez-x5/include -Wall -Wstrict-prototypes -Wno-trigraphs -O2 -fno-strict-aliasing -fno-common -Uarm -fno-common -pipe -mapcs-32 -D__LINUX_ARM_ARCH__=3 -march=armv3  -mshort-load-bytes -msoft-float -Uarm " -C  drivers
>make[1]: Entering directory `/project/ez-x5/test/kernel/linux-2.4.19-rmk7-pxa1-ez-x5/drivers'
>make -C block
>make[2]: Entering directory `/project/ez-x5/test/kernel/linux-2.4.19-rmk7-pxa1-ez-x5/drivers/block'
>make -C ../acorn/block
>make[3]: Entering directory `/project/ez-x5/test/kernel/linux-2.4.19-rmk7-pxa1-ez-x5/drivers/acorn/block'
>make all_targets
>make[4]: Entering directory `/project/ez-x5/test/kernel/linux-2.4.19-rmk7-pxa1-ez-x5/drivers/acorn/block'
>make[4]: `all_targets'를 위해 할 일이 없습니다
>make[4]: Leaving directory `/project/ez-x5/test/kernel/linux-2.4.19-rmk7-pxa1-ez-x5/drivers/acorn/block'
>make[3]: Leaving directory `/project/ez-x5/test/kernel/linux-2.4.19-rmk7-pxa1-ez-x5/drivers/acorn/block'
>make all_targets
>make[3]: Entering directory `/project/ez-x5/test/kernel/linux-2.4.19-rmk7-pxa1-ez-x5/drivers/block'
>make[3]: `all_targets'를 위해 할 일이 없습니다
>make[3]: Leaving directory `/project/ez-x5/test/kernel/linux-2.4.19-rmk7-pxa1-ez-x5/drivers/block'
>make[2]: Leaving directory `/project/ez-x5/test/kernel/linux-2.4.19-rmk7-pxa1-ez-x5/drivers/block'
>make -C cdrom
>make[2]: Entering directory `/project/ez-x5/test/kernel/linux-2.4.19-rmk7-pxa1-ez-x5/drivers/cdrom'
>make all_targets
>make[3]: Entering directory `/project/ez-x5/test/kernel/linux-2.4.19-rmk7-pxa1-ez-x5/drivers/cdrom'
>make[3]: `all_targets'를 위해 할 일이 없습니다
>make[3]: Leaving directory `/project/ez-x5/test/kernel/linux-2.4.19-rmk7-pxa1-ez-x5/drivers/cdrom'
>make[2]: Leaving directory `/project/ez-x5/test/kernel/linux-2.4.19-rmk7-pxa1-ez-x5/drivers/cdrom'
>make -C char
>make[2]: Entering directory `/project/ez-x5/test/kernel/linux-2.4.19-rmk7-pxa1-ez-x5/drivers/char'
>make -C ../acorn/char
>make[3]: Entering directory `/project/ez-x5/test/kernel/linux-2.4.19-rmk7-pxa1-ez-x5/drivers/acorn/char'
>make all_targets
>make[4]: Entering directory `/project/ez-x5/test/kernel/linux-2.4.19-rmk7-pxa1-ez-x5/drivers/acorn/char'
>make[4]: `all_targets'를 위해 할 일이 없습니다
>make[4]: Leaving directory `/project/ez-x5/test/kernel/linux-2.4.19-rmk7-pxa1-ez-x5/drivers/acorn/char'
>make[3]: Leaving directory `/project/ez-x5/test/kernel/linux-2.4.19-rmk7-pxa1-ez-x5/drivers/acorn/char'
>make all_targets
>make[3]: Entering directory `/project/ez-x5/test/kernel/linux-2.4.19-rmk7-pxa1-ez-x5/drivers/char'
>armv5l-linux-gcc -D__KERNEL__ -I/project/ez-x5/test/kernel/linux-2.4.19-rmk7-pxa1-ez-x5/include -Wall -Wstrict-prototypes -Wno-trigraphs -O2 -fno-strict-aliasing -fno-common -Uarm -fno-common -pipe -mapcs-32 -D__LINUX_ARM_ARCH__=3 -march=armv3  -mshort-load-bytes -msoft-float -Uarm   -nostdinc -I /usr/lib/gcc-lib/armv5l-linux/3.2.1/include -DKBUILD_BASENAME=mk712   -c -o mk712.o mk712.c
>mk712.c:110: `MK712_DEFAULT_IO' undeclared here (not in a function)
>mk712.c:111: `MK712_DEFAULT_IRQ' undeclared here (not in a function)
>mk712.c: In function `mk712_interrupt':
>mk712.c:381: `debug_proc' undeclared (first use in this function)
>mk712.c:381: (Each undeclared identifier is reported only once
>mk712.c:381: for each function it appears in.)
>mk712.c:319: warning: unused variable `xl'
>mk712.c:319: warning: unused variable `yl'
>mk712.c:319: warning: unused variable `xh'
>mk712.c:319: warning: unused variable `yh'
>mk712.c: In function `mk712_init':
>mk712.c:542: warning: implicit declaration of function `set_GPIO_IRQ_edge'
>mk712.c:542: `MK712_DEFAULT_GPIO_IRQ' undeclared (first use in this function)
>mk712.c:542: `GPIO_RISING_EDGE' undeclared (first use in this function)
>make[3]: *** [mk712.o] 오류 1
>make[3]: Leaving directory `/project/ez-x5/test/kernel/linux-2.4.19-rmk7-pxa1-ez-x5/drivers/char'make[2]: *** [first_rule] 오류 2
>make[2]: Leaving directory `/project/ez-x5/test/kernel/linux-2.4.19-rmk7-pxa1-ez-x5/drivers/char'make[1]: *** [_subdir_char] 오류 2
>make[1]: Leaving directory `/project/ez-x5/test/kernel/linux-2.4.19-rmk7-pxa1-ez-x5/drivers'
>make: *** [_dir_drivers] 오류 2
>
>이런 에러가 뜹니다. 물론 zImage는 생성되지도 않구요..orz... 하루종일 고민했습니다. 어떻게 하면 좋을가요?
이 게시물을
  • Twitter
  • Facebook
  • Delicious
수정 삭제 목록

댓글 0

목록
번호 제목 글쓴이 날짜 조회 수
공지 포럼의 메뉴가 보이지 않아요! 장길석 2014.02.06 957656
공지 [중요 공지]제품 사용 및 기술 문의는 전화 상담을 받지 않습니다. 장길석 2012.11.09 1408549
공지 답글에 대한 공지 사항. falinux 2006.11.20 2424043
15341 [특판][성Y인Y용Y품][비아][시알][여성흥분제] 전부 1+1 vv8282.top 지금 확인해보세요~! dde33 2026.10.15 2
15340 요즘 잘 나가는,,, dde33 2026.09.12 845
15339 buildroot 사용 관련 로즈마리 2021.02.01 38166
15338 GPIO 제어 방법 문의 [1] 단순최고 2021.01.25 51084
15337 임베디드 리눅스 개발 보드 추천 nam 2019.12.06 48864
15336 make wandboard_quad 실행시 문제 gasi 2019.08.27 47085
15335 LCD 초기화 코드 좀 봐주세요 [1] 김용수 2019.07.12 63137
15334 임베디드 리눅스 커널 소스에 관해 질문드립니다 ! ekthatkxkd 2019.06.28 43728
15333 numpy,scipy 를 arm-linux-XXXX 로 크로스컴파일 하여 올릴수 있나요? 초보자 2019.06.24 49287
15332 I2C - deal with arbitration loss 오류가 궁금합니다. [1] S1eepingBeauty 2018.12.10 56771
15331 구형 EM-PXA270 보드 혹시 보유하시분 연락 주시면 감사드릴께요. file 존 2018.11.24 42753
15330 리눅스 GPIO 관련 센서의 단선 또는 고장유무 판별법이 궁금합니다. [2] S1eepingBeauty 2018.11.12 55126
15329 임베디드 리눅스에서 c 언어 디버깅 궁금합니다. [1] 존 2018.09.14 47072
15328 부팅 시간 문의 [1] nam 2018.06.29 45794
15327 localport? port? 검은고래 2018.06.29 39961
15326 fork()의 thread 멈추는 현상 [4] HwangRoy 2018.05.09 58616
15325 임베디드 리눅스 습득용 보드 판매하시나요? 임베디드초급자 2018.04.27 39719
15324 (도와주세요)네트워크 디바이스 드라이버 수정문제입니다. [1] Chanmini 2018.03.04 43601
15323 Ez x5 구합니다!! khobaik 2018.01.26 38317
15322 실행중 symbol not found 를 발생시키는 u-boot 본적 있으신가요 ? sayyouandme 2017.12.17 57349
첫 페이지 1 2 3 4 5 6 7 8 9 10 끝 페이지
쓰기
태그
부탁드립니다. ^^
  • 글을 작성하시려면 회원으로 가입하시고 로그인 하셔야 합니다.
  • 회원 가입은 주민등록번호가 필요 없으며, 메일 주소만 있으면 간단하게 가입하실 수 있습니다.
  • 본 포럼에 등록된 모든 글의 저작권은 작성하신 분께 있으며, 저작자의 허락 없이 다른 곳에 펌이나 도용하시면 안 됩니다.
  • 또한, 전자우편 수집 프로그램이나 그 밖의 기술적 장치를 이용하여 무단으로 이메일 주소 및 자료 수집되는 것을 거부하며,
  • 이를 위반 시 정보통신망 법에 의해 형사 처벌됨을 유념하시기 바랍니다.
  • FF 포럼
  • 강좌 & 팁
  • 함수설명
  • 자료실
  • 도와주세요