logo
한국어 Select Language
FF 포럼
포럼지기에게 한 마디
공지사항
뉴스 EZ보드 통합 메뉴얼
FA-VUS 개발환경 !강추! 타켓보드 부팅-HyperTerminal 타켓보드 부팅-Tutty 타켓보드 부팅-minicom Windows환경-타겟 Linux 구동 Linux환경-타겟 Linux 구동 개발 시스템 구축 유형 페도라 설치 CentOS 설치 크로스 컴파일러 설치 TFTP 환경 구축 NFS 파일 시스템 구축 삼바 서버 구축 부트로더 부트로더 쓰기 커널 이미지 제작 및 설치 램디스크 이미지 제작 및 설치
임베디드 제품 사용기 오늘의 영어 휴게실 Appliance
강좌 & 팁
강좌 & 팁 EZ-보드 그래픽 & 멀티미디어 네트워크 프로그래밍 디바이스 드라이버 ImJa 솔루션 임베디드 FLEX 안드로이드 iOS 개발 FAIDE 하드웨어 C/C++ go언어 GNU C 레퍼런스 메뉴얼 ARM 루아 응용 프로젝트 이클립스 지그비 개발자 노트 권장도서 FPGA
VIVADO DSP HSIO Logic Zynq
함수설명
C 라이브러리 함수 커널 API 그래픽 라이브러리 - gxLib
자료실
자료실 FALINUX SDK ARM PC-V210 S3C6410
G100-S3C6410 S100-S3C6410 C221-S3C6410 N200-S3C6410 EZ-S3C6410
S5PV210
G100-S5PV210 S100-S5PV210 N200-S5PV210 C221-S5PV210
EZ-S3C2440 EZ-PXA270 EZ-X5 EZ-S2410 Auto Package
도와주세요
FAQ 도와주세요

  • 회원가입
  • ID/PW 찾기
 
  1. FAQ

  2. 도와주세요


최근 글

  • [특판][성Y인Y용Y품][...
  • 요즘 잘 나가는,,,
  • 요즘은 vmware 말고 ...
  • [docker] buildx 를 ...
  • buildroot 사용 관련
  • GPIO 제어 방법 문의 [1]
  • 임베디드 리눅스 개발...
  • make wandboard_quad ...
  • LCD 초기화 코드 좀 ... [1]
  • 임베디드 리눅스 커널...

최근 댓글

  • 오래 전에 해결법을 터득해서 ...
  • 비트 코인으로 작업하는 것은 ...
  • 10년차 임베 엔지니어 입니다. ...
  • 임베디드쪽이라면 SOC 쪽 displ...
  • 그렇군요 제가 질문이 잘못됬었...
  • 취준생으로서 포트폴리오를 만...
  • 제가 현재 취업준비생입니다. ...
  • 에프에이리눅스 보드는 아래 링...
  • 전체
  • 일반
  • X5
  • S2410
  • ESP-NS
  • S3C2440
  • EP9312
  • 구매
  • 기타

pxa270보드 gpio test 질문드립니다.

2010.09.30 13:26

원시인 조회 수:19803

완전 초짜입니다. 개발환경구축후 GPIO 테스트 해보려고 합니다,

그래서 EZ-S3C2440 보드로 GPIO 테스트 하는 프로그램있길래 쫓아해봤는데요,

제가 가지고있는 보드는 EZ-PXA270 보드입니다.

make clean 후 make 하니까 밑에와 같은 오류가 납니다.

재생각에는 보드가 틀려서 생기는 오류인거 갔습니다. 아닌가요?ㅋㅋ

 

....생략
/root/project/dev-gpio/dev_gpio.c: In function `hw_gpio_init':
/root/project/dev-gpio/dev_gpio.c:68: warning: implicit declaration of function `gpio_direction_input'
/root/project/dev-gpio/dev_gpio.c:68: error: `S3C2410_GPG5' undeclared (first use in this function)
/root/project/dev-gpio/dev_gpio.c:69: warning: implicit declaration of function `set_irq_type'
/root/project/dev-gpio/dev_gpio.c:69: error: `IRQ_EINT13' undeclared (first use in this function)
/root/project/dev-gpio/dev_gpio.c:69: error: `IRQT_RISING' undeclared (first use in this function)
/root/project/dev-gpio/dev_gpio.c:70: warning: implicit declaration of function `s3c2410_gpio_pullup'
/root/project/dev-gpio/dev_gpio.c:70: error: `S3C2410_GPE11' undeclared (first use in this function)
/root/project/dev-gpio/dev_gpio.c:73: error: `S3C2410_GPG11' undeclared (first use in this function)
/root/project/dev-gpio/dev_gpio.c:74: error: `S3C2410_GPE5' undeclared (first use in this function)
/root/project/dev-gpio/dev_gpio.c:78: warning: implicit declaration of function `gpio_direction_output'
/root/project/dev-gpio/dev_gpio.c:78: error: `S3C2410_GPF0' undeclared (first use in this function)
/root/project/dev-gpio/dev_gpio.c:79: error: `S3C2410_GPF1' undeclared (first use in this function)
/root/project/dev-gpio/dev_gpio.c:80: error: `S3C2410_GPF2' undeclared (first use in this function)
/root/project/dev-gpio/dev_gpio.c:81: error: `S3C2410_GPF3' undeclared (first use in this function)
/root/project/dev-gpio/dev_gpio.c:82: error: `S3C2410_GPF4' undeclared (first use in this function)
/root/project/dev-gpio/dev_gpio.c:83: error: `S3C2410_GPF5' undeclared (first use in this function)
/root/project/dev-gpio/dev_gpio.c:84: error: `S3C2410_GPF6' undeclared (first use in this function)
/root/project/dev-gpio/dev_gpio.c:85: error: `S3C2410_GPF7' undeclared (first use in this function)
/root/project/dev-gpio/dev_gpio.c: In function `gpio_btn_interrupt':
/root/project/dev-gpio/dev_gpio.c:96: warning: implicit declaration of function `s3c2410_gpio_setpin'
/root/project/dev-gpio/dev_gpio.c:96: error: `S3C2410_GPF4' undeclared (first use in this function)
/root/project/dev-gpio/dev_gpio.c: At top level:
/root/project/dev-gpio/dev_gpio.c:105: error: parse error before "gpio_read"
/root/project/dev-gpio/dev_gpio.c:105: error: parse error before "size_t"
/root/project/dev-gpio/dev_gpio.c:106: warning: return type defaults to `int'
/root/project/dev-gpio/dev_gpio.c:106: warning: function declaration isn't a prototype
/root/project/dev-gpio/dev_gpio.c: In function `gpio_read':
/root/project/dev-gpio/dev_gpio.c:114: warning: implicit declaration of function `gpio_get_value'
/root/project/dev-gpio/dev_gpio.c:114: error: `S3C2410_GPG11' undeclared (first use in this function)
/root/project/dev-gpio/dev_gpio.c:124: warning: implicit declaration of function `put_user'
/root/project/dev-gpio/dev_gpio.c: In function `set_gpio_f':
/root/project/dev-gpio/dev_gpio.c:138: warning: implicit declaration of function `gpio_set_value'
/root/project/dev-gpio/dev_gpio.c:138: error: `S3C2410_GPF0' undeclared (first use in this function)
/root/project/dev-gpio/dev_gpio.c:139: error: `S3C2410_GPF1' undeclared (first use in this function)
/root/project/dev-gpio/dev_gpio.c:140: error: `S3C2410_GPF2' undeclared (first use in this function)
/root/project/dev-gpio/dev_gpio.c:141: error: `S3C2410_GPF3' undeclared (first use in this function)
/root/project/dev-gpio/dev_gpio.c:142: error: `S3C2410_GPF4' undeclared (first use in this function)
/root/project/dev-gpio/dev_gpio.c:143: error: `S3C2410_GPF5' undeclared (first use in this function)
/root/project/dev-gpio/dev_gpio.c:144: error: `S3C2410_GPF6' undeclared (first use in this function)
/root/project/dev-gpio/dev_gpio.c:145: error: `S3C2410_GPF7' undeclared (first use in this function)
/root/project/dev-gpio/dev_gpio.c: In function `gpio_ioctl':
/root/project/dev-gpio/dev_gpio.c:157: warning: implicit declaration of function `_IOC_TYPE'
/root/project/dev-gpio/dev_gpio.c:157: error: `EINVAL' undeclared (first use in this function)
/root/project/dev-gpio/dev_gpio.c:158: warning: implicit declaration of function `_IOC_NR'
/root/project/dev-gpio/dev_gpio.c:162: warning: implicit declaration of function `_IOW'
/root/project/dev-gpio/dev_gpio.c:162: error: parse error before "int"
/root/project/dev-gpio/dev_gpio.c:163: error: parse error before "int"
/root/project/dev-gpio/dev_gpio.c: At top level:
/root/project/dev-gpio/dev_gpio.c:195: error: variable `gpio_fops' has initializer but incomplete type
/root/project/dev-gpio/dev_gpio.c:197: error: unknown field `open' specified in initializer
/root/project/dev-gpio/dev_gpio.c:197: warning: excess elements in struct initializer
/root/project/dev-gpio/dev_gpio.c:197: warning: (near initialization for `gpio_fops')
/root/project/dev-gpio/dev_gpio.c:198: error: unknown field `release' specified in initializer
/root/project/dev-gpio/dev_gpio.c:198: warning: excess elements in struct initializer
/root/project/dev-gpio/dev_gpio.c:198: warning: (near initialization for `gpio_fops')
/root/project/dev-gpio/dev_gpio.c:199: error: unknown field `read' specified in initializer
/root/project/dev-gpio/dev_gpio.c:199: warning: excess elements in struct initializer
/root/project/dev-gpio/dev_gpio.c:199: warning: (near initialization for `gpio_fops')
/root/project/dev-gpio/dev_gpio.c:200: error: unknown field `ioctl' specified in initializer
/root/project/dev-gpio/dev_gpio.c:200: warning: excess elements in struct initializer
/root/project/dev-gpio/dev_gpio.c:200: warning: (near initialization for `gpio_fops')
/root/project/dev-gpio/dev_gpio.c: In function `gpio_init':
/root/project/dev-gpio/dev_gpio.c:219: error: `EBUSY' undeclared (first use in this function)
/root/project/dev-gpio/dev_gpio.c:226: error: `IRQ_EINT13' undeclared (first use in this function)
/root/project/dev-gpio/dev_gpio.c:226: warning: passing arg 2 of `request_irq' from incompatible pointer type
/root/project/dev-gpio/dev_gpio.c: In function `gpio_exit':
/root/project/dev-gpio/dev_gpio.c:248: error: `IRQ_EINT13' undeclared (first use in this function)
/root/project/dev-gpio/dev_gpio.c: At top level:
include/linux/elf.h:367: warning: array '_DYNAMIC' assumed to have one element
include/linux/stat.h:68: error: storage size of `atime' isn't known
include/linux/stat.h:69: error: storage size of `mtime' isn't known
include/linux/stat.h:70: error: storage size of `ctime' isn't known
include/linux/fs.h:344: error: storage size of `ia_atime' isn't known
include/linux/fs.h:345: error: storage size of `ia_mtime' isn't known
include/linux/fs.h:346: error: storage size of `ia_ctime' isn't known
include/linux/quota.h:227: error: storage size of `dq_dqb' isn't known
include/linux/fs.h:462: error: storage size of `bd_mutex' isn't known
include/linux/fs.h:463: error: storage size of `bd_mount_sem' isn't known
include/linux/fs.h:544: error: storage size of `i_atime' isn't known
include/linux/fs.h:545: error: storage size of `i_mtime' isn't known
include/linux/fs.h:546: error: storage size of `i_ctime' isn't known
include/linux/fs.h:552: error: storage size of `i_mutex' isn't known
include/linux/fs.h:553: error: storage size of `i_alloc_sem' isn't known
include/linux/fs.h:726: error: storage size of `f_owner' isn't known
include/linux/fs.h:917: error: storage size of `s_umount' isn't known
include/linux/fs.h:918: error: storage size of `s_lock' isn't known
include/linux/fs.h:949: error: storage size of `s_vfs_rename_mutex' isn't known
include/linux/aio.h:115: error: storage size of `ki_inline_vec' isn't known
include/linux/sched.h:326: error: storage size of `mmap_sem' isn't known
include/linux/sched.h:380: error: storage size of `action' isn't known
include/linux/sched.h:409: error: storage size of `shared_pending' isn't known
include/linux/sched.h:429: error: storage size of `real_timer' isn't known
include/linux/sched.h:478: error: storage size of `rlim' isn't known
include/linux/sched.h:887: error: storage size of `start_time' isn't known
include/linux/sched.h:928: error: storage size of `thread' isn't known
include/linux/sched.h:941: error: storage size of `pending' isn't known
include/linux/device.h:267: error: storage size of `uevent_attr' isn't known
include/linux/device.h:435: error: storage size of `archdata' isn't known
include/linux/mod_devicetable.h:298: error: storage size of `evbit' isn't known
include/linux/mod_devicetable.h:299: error: storage size of `keybit' isn't known
include/linux/mod_devicetable.h:300: error: storage size of `relbit' isn't known
include/linux/mod_devicetable.h:301: error: storage size of `absbit' isn't known
include/linux/mod_devicetable.h:302: error: storage size of `mscbit' isn't known
include/linux/mod_devicetable.h:303: error: storage size of `ledbit' isn't known
include/linux/mod_devicetable.h:304: error: storage size of `sndbit' isn't known
include/linux/mod_devicetable.h:305: error: storage size of `ffbit' isn't known
include/linux/mod_devicetable.h:306: error: storage size of `swbit' isn't known
include/linux/i2c.h:225: error: storage size of `bus_lock' isn't known
include/linux/i2c.h:226: error: storage size of `clist_lock' isn't known
include/linux/i2c.h:230: error: storage size of `dev' isn't known
include/linux/i2c.h:231: error: storage size of `class_dev' isn't known
/root/project/dev-gpio/dev_gpio.c:195: error: storage size of `gpio_fops' isn't known
make[2]: *** [/root/project/dev-gpio/dev_gpio.o] 오류 1
make[1]: *** [_module_/root/project/dev-gpio] 오류 2
make[1]: Leaving directory `/root/project/linux-2.6.21'
make: *** [default] 오류 2

이 게시물을
  • Twitter
  • Facebook
  • Delicious
목록

댓글 1

  • 원시인

    2010.10.01 12:29

    자답하겠습니다. 오류이유는..

     

    kernel 가져오고 나서  kernel 폴더안에서 sh falinux-config.sh <보드명> 이후 make 를 안해줘서 그렇습니다.ㅠㅠ

    이렇게 하나하나 배워나가는 거죠.ㅋㅋㅋㅋㅋㅋ

    제가 한 답이 맞나요? 

    컴파일은 되긴 대는데.. 맞게 한건지요?

    댓글

목록
번호 제목 글쓴이 날짜 조회 수
공지 포럼의 메뉴가 보이지 않아요! 장길석 2014.02.06 957660
공지 [중요 공지]제품 사용 및 기술 문의는 전화 상담을 받지 않습니다. 장길석 2012.11.09 1408551
공지 답글에 대한 공지 사항. falinux 2006.11.20 2424046
15341 [특판][성Y인Y용Y품][비아][시알][여성흥분제] 전부 1+1 vv8282.top 지금 확인해보세요~! dde33 2026.10.15 2
15340 요즘 잘 나가는,,, dde33 2026.09.12 845
15339 buildroot 사용 관련 로즈마리 2021.02.01 38166
15338 GPIO 제어 방법 문의 [1] 단순최고 2021.01.25 51084
15337 임베디드 리눅스 개발 보드 추천 nam 2019.12.06 48864
15336 make wandboard_quad 실행시 문제 gasi 2019.08.27 47085
15335 LCD 초기화 코드 좀 봐주세요 [1] 김용수 2019.07.12 63137
15334 임베디드 리눅스 커널 소스에 관해 질문드립니다 ! ekthatkxkd 2019.06.28 43728
15333 numpy,scipy 를 arm-linux-XXXX 로 크로스컴파일 하여 올릴수 있나요? 초보자 2019.06.24 49288
15332 I2C - deal with arbitration loss 오류가 궁금합니다. [1] S1eepingBeauty 2018.12.10 56771
15331 구형 EM-PXA270 보드 혹시 보유하시분 연락 주시면 감사드릴께요. file 존 2018.11.24 42753
15330 리눅스 GPIO 관련 센서의 단선 또는 고장유무 판별법이 궁금합니다. [2] S1eepingBeauty 2018.11.12 55126
15329 임베디드 리눅스에서 c 언어 디버깅 궁금합니다. [1] 존 2018.09.14 47072
15328 부팅 시간 문의 [1] nam 2018.06.29 45794
15327 localport? port? 검은고래 2018.06.29 39961
15326 fork()의 thread 멈추는 현상 [4] HwangRoy 2018.05.09 58616
15325 임베디드 리눅스 습득용 보드 판매하시나요? 임베디드초급자 2018.04.27 39719
15324 (도와주세요)네트워크 디바이스 드라이버 수정문제입니다. [1] Chanmini 2018.03.04 43601
15323 Ez x5 구합니다!! khobaik 2018.01.26 38317
15322 실행중 symbol not found 를 발생시키는 u-boot 본적 있으신가요 ? sayyouandme 2017.12.17 57349
첫 페이지 1 2 3 4 5 6 7 8 9 10 끝 페이지
쓰기
태그
부탁드립니다. ^^
  • 글을 작성하시려면 회원으로 가입하시고 로그인 하셔야 합니다.
  • 회원 가입은 주민등록번호가 필요 없으며, 메일 주소만 있으면 간단하게 가입하실 수 있습니다.
  • 본 포럼에 등록된 모든 글의 저작권은 작성하신 분께 있으며, 저작자의 허락 없이 다른 곳에 펌이나 도용하시면 안 됩니다.
  • 또한, 전자우편 수집 프로그램이나 그 밖의 기술적 장치를 이용하여 무단으로 이메일 주소 및 자료 수집되는 것을 거부하며,
  • 이를 위반 시 정보통신망 법에 의해 형사 처벌됨을 유념하시기 바랍니다.
  • FF 포럼
  • 강좌 & 팁
  • 함수설명
  • 자료실
  • 도와주세요